program: Gaussian 09
title: 000297396
version: EM64L-G09RevD.01
frameworkgroup: C1[X(C10H12O4)]
method: RPBEPBE
basis: SDD
operation: Freq
keyword: #pfreq=noraman
keyword: PBEPBE/SDD
title: #p freq=noraman PBEPBE/SDD
converged: YES YES NO NO
title: Mulliken charges:
elementType: O O O O C C C C C C C C C C H H H H H H H H H H H H
charge: -0.257068 -0.448797 -0.441987 -0.265146 0.370716 -0.629094 0.083490 -0.522568 0.282219 0.303718 -0.345677 -0.349182 -0.265035 -0.664145 0.291326 0.246478 0.272656 0.218614 0.252051 0.234426 0.225013 0.217900 0.228455 0.247896 0.357745 0.355996
chargesum: 0.00000
title: Mulliken charges with hydrogens summed into heavy atoms:
elementType: O O O O C C C C C C C C C C
charge: -0.257068 -0.091052 -0.085991 -0.265146 0.370716 -0.091289 0.083490 -0.249912 0.282219 0.303718 -0.127063 -0.097132 0.194404 0.030106
polarizability: 1.55860417e+02 -3.01083300e+00 1.34165959e+02 8.79103709e+00 3.74016426e+00 7.34006167e+01
1716.lowfreq: -15.9658 -11.2728 -1.1382 -0.0007 -0.0004 0.0001 3.5495 21.7435 47.7775
frequency: -11.9902 20.1817 47.7533 97.3202 116.8558 138.2518 195.7837 202.8819 242.7837 277.3381 303.3553 333.9218 341.5617 346.7619 357.6021 420.9715 434.0880 458.0528 488.4265 526.4993 575.2812 611.0046 691.7131 709.8561 717.0243 760.5290 795.7017 803.9678 817.5969 876.0014 902.0706 917.2963 940.8286 955.4736 1016.5978 1066.5998 1094.8850 1116.8283 1133.0646 1149.0468 1156.2251 1172.3111 1214.9414 1228.5876 1263.3276 1277.7971 1307.8284 1337.2763 1358.3759 1389.7353 1398.0896 1429.9512 1455.1142 1456.2073 1462.4999 1484.4820 1510.0225 1616.6956 1626.7765 1629.6842 2983.6517 2993.0558 3031.0960 3088.2303 3093.8488 3113.6877 3117.4627 3120.2116 3124.5695 3176.0528 3584.5531 3594.7848
redmass: 4.2145 4.2198 3.2475 4.3073 5.0294 5.8709 1.4447 3.7741 3.3635 2.1774 1.1161 4.1368 1.1832 3.3243 6.4166 3.9259 2.9359 6.2415 3.7951 4.0517 3.8837 4.2843 4.8290 4.0433 5.7441 3.5800 1.4947 1.8695 2.2307 1.5833 3.1646 1.3856 2.5504 2.7449 3.0767 2.2881 2.1774 1.9829 1.6855 1.2065 1.6753 1.4269 1.3706 1.9949 2.1367 1.1237 2.4942 1.3839 1.3934 1.2371 5.5130 2.9425 1.1386 1.1025 1.0435 1.0514 2.9335 6.7830 7.1013 8.0815 1.0681 1.0360 1.0595 1.0973 1.1030 1.0912 1.0900 1.1063 1.0920 1.0949 1.0660 1.0661
irintensity: 0.9908 0.5624 0.5470 0.7406 2.4766 0.4730 3.7145 5.7966 0.9570 16.2455 119.5843 14.8910 147.5413 15.0250 1.4138 5.2377 14.7127 6.8200 2.3218 22.6734 5.3776 4.4066 9.0605 2.3680 47.9175 1.1669 37.0814 18.2665 1.5180 43.2637 18.4505 0.3985 8.6900 0.5029 77.2579 78.6664 49.6434 320.1853 159.7167 111.5655 13.5548 39.4597 85.0629 28.5461 11.1127 5.2478 32.6848 42.8055 16.0539 24.4328 62.6641 90.0513 60.0552 2.3374 13.7095 12.9954 79.4131 13.2828 37.4343 97.7268 10.1918 21.2856 27.9936 35.0262 0.9744 1.3581 16.9273 32.6430 6.3776 5.9635 38.0394 28.5676
temp: 298.150 k
press: 1.00000 atm
elementType: 8 8 8 8 6 6 6 6 6 6 6 6 6 6 1 1 1 1 1 1 1 1 1 1 1 1
symmnumber: 1
zpe: 531135.3 jmol-1
zpe.correction: 0.202299 hartree
zpe.thermalcorrener: 0.215762 hartree
zpe.thermalcorrenthalpy: 0.216706 hartree
zpe.thermalcorrgfe: 0.161248 hartree
zpe.sumelectzpe: -688.104883 hartree
zpe.sumelectthermal: -688.091420 hartree
zpe.sumelectthermalent: -688.090476 hartree
zpe.sumelectthermalfe: -688.145933 hartree
dipole: -1.1848 1.5269 0.4859
dipole: 1.9928
quadrupole: -72.1730 -75.8346 -82.1544
quadrupole: 9.3663 -1.0799 2.1346
quadrupole: 4.5477 0.8861 -5.4338 9.3663 -1.0799 2.1346
hfenergy: -688.3071816 hartree
pointgroup: C01 [X(C10H12O4)]
dipole: 0.5070364 0.5866041 -0.1163471 debye
dipolederiv: -1.4493923 -0.1043897 0.311609 -0.2067052 -0.5038945 0.1075623 0.6129245 0.0739389 -0.4898112 -0.2320928 -0.400048 0.0592544 -0.3222005 -1.2403307 -0.1686529 0.0625716 -0.1904453 -0.3883892 -0.3146511 -0.4518077 0.0388804 -0.5440721 -1.2313657 -0.1682047 0.0237127 -0.1619089 -0.4202996 -0.747808 0.0973197 0.0918743 -0.2351768 -0.8485687 0.116773 0.172653 -0.0277621 -0.3719663 0.4027135 0.0972336 0.0966139 -0.1545189 -0.0848519 -0.116696 0.244236 0.0076447 -0.0085046 -0.3099368 0.0728181 0.084229 0.1235284 -0.0457245 -0.0334957 0.064339 -0.0928858 0.0258483 -0.1269428 0.3663882 -0.0045021 0.3111457 1.0646851 0.1775252 -0.0306994 0.1638061 0.0299601 -0.17046 -0.2846178 0.0234914 0.0286962 -0.1674129 0.0217888 -0.0012829 -0.0773728 -0.1811649 1.5807955 0.0336855 -0.4866746 0.4484752 1.0428125 -0.215451 -0.8224338 -0.011541 0.4571523 0.1056485 0.4192928 0.0234385 0.5719063 1.1589641 0.1743733 0.0190471 0.1689666 0.0697394 0.0587569 -0.2501695 0.0673008 0.146356 -0.0664054 0.0280137 0.0719855 -0.0848584 -0.1553753 0.0213594 0.1303365 0.0731712 -0.3056392 -0.1607376 -0.0832894 0.0543188 0.0427083 -0.1429156 0.7760111 -0.065761 -0.0890172 -0.2504414 0.261244 0.0590042 -0.1895042 -0.0333955 0.3796271 -0.1304178 0.0474163 -0.0500547 0.0923324 0.0345388 0.0119361 -0.0266421 0.0619486 -0.073232 0.0808595 -0.0320537 0.0064647 -0.0650985 0.0229717 0.0007151 0.0216688 0.0207137 0.1128891 0.0028907 0.0138934 -0.0281866 0.0420314 0.0847605 0.0519291 -0.0541982 0.0222468 -0.0602631 0.1863845 0.0509315 -0.0339204 0.0464423 -0.0141433 0.0088061 -0.0167502 0.0011775 0.1523946 0.0333036 0.0740856 -0.036905 0.0990488 -0.0909273 0.0243494 -0.0418193 0.0171165 0.1558255 -0.0430558 -0.0245366 -0.0698115 -0.0224317 0.0977349 -0.0098474 -0.0704086 -0.0095775 0.1496271 -0.0235254 -0.05864 -0.0616284 0.0348692 -0.0220122 -0.1221136 -0.0148075 -0.0419393 0.0245113 -0.0233484 -0.0039378 0.0528817 -0.0039192 0.0010286 0.126242 0.073732 0.0845946 -0.0377788 -0.1089182 0.0879774 0.0859386 0.1123561 0.0695333 -0.0552288 0.0773201 -0.0595401 0.0452205 0.0802944 -0.0373237 -0.0493963 -0.08841 -0.0635658 -0.0952892 -0.0776117 -0.0672589 0.0350343 0.0887404 -0.0721001 0.0625347 -0.0550185 0.021583 0.096489 0.0172479 0.086053 -0.0115075 0.1177603 0.1480126 -0.0906273 0.0724454 0.3424465 0.0331282 -0.0953848 0.067521 0.3469827 0.145031 0.1459945 -0.0769584 0.1239984 0.3376375 0.0296335 -0.0742146 0.040049 0.3563957 unknown
polarizability: 155.8923824|0.4940626|134.0414958|9.8609906|2.7870667|73.4931152 unknown
InChI: InChI=1S/C10H12O4/c1-2-14-10(13)6-7-5-8(11)3-4-9(7)12/h3-5,11-12H,2,6H2,1H3
charge 0 multiplicity 1
26 atoms
O  2.860142 0.416632 -0.230021
O  -0.877681 2.769286 0.473768
O  -3.0666 -2.351722 -0.393137
O  1.817353 -1.588556 0.337792
C  -0.616703 0.365622 0.491372
C  0.806909 0.578391 1.001406
C  -1.442665 1.492668 0.24239
C  -1.159244 -0.924596 0.284309
C  1.839611 -0.333236 0.353056
C  -2.488561 -1.085576 -0.168645
C  -2.774159 1.329139 -0.208055
C  -3.302983 0.040203 -0.416722
C  3.972312 -0.351259 -0.876987
C  5.043788 -0.721315 0.152151
H  1.10223 1.627094 0.856451
H  0.83739 0.371701 2.090787
H  -0.516846 -1.795383 0.466563
H  -3.403721 2.208242 -0.397701
H  -4.328955 -0.10527 -0.765502
H  3.544955 -1.249887 -1.355399
H  4.352945 0.345014 -1.641023
H  5.897454 -1.206884 -0.35625
H  5.417976 0.177734 0.671582
H  4.642765 -1.426408 0.899457
H  -1.516575 3.481338 0.225406
H  -2.412136 -3.069574 -0.206749
