program: Gaussian 09
title: 000295649
version: EM64L-G09RevD.01
frameworkgroup: C1[X(C13H16N2O)]
method: RPBEPBE
basis: SDD
operation: Freq
keyword: #p
keyword: freq=noraman
keyword: PBEPBE/SDD
title: #p freq=noraman PBEPBE/SDD
converged: YES YES NO NO
title: Mulliken charges:
elementType: O N N C C C C C C C C C C C C C H H H H H H H H H H H H H H H H
charge: -0.279716 -0.224227 -0.633908 -0.234864 -0.577109 0.257057 0.311697 0.501864 -0.654547 -0.411709 -0.393215 -0.820549 -0.490166 -0.262070 -0.219125 0.222949 0.227419 0.234390 0.244722 0.214550 0.232773 0.242439 0.234554 0.231330 0.244064 0.285984 0.232189 0.199160 0.222091 0.218864 0.333293 0.309819
chargesum: 0.00000
title: Mulliken charges with hydrogens summed into heavy atoms:
elementType: O N N C C C C C C C C C C C C C
charge: -0.279716 -0.224227 0.009205 -0.007445 -0.097997 0.257057 0.311697 0.501864 0.035214 -0.177155 -0.161885 -0.058312 -0.291006 -0.039979 -0.000262 0.222949
polarizability: 2.43515614e+02 -7.15211745e+00 1.33603385e+02 1.33336075e+01 9.81476186e-01 1.11452419e+02
1716.lowfreq: -16.3303 -9.6371 -5.5618 -0.0009 -0.0006 -0.0005 25.6464 31.7894 39.3296
frequency: 22.4990 31.5126 39.2558 54.5571 106.5587 119.0101 130.6823 177.0060 205.2920 219.7860 224.9982 262.3141 274.8929 318.4437 369.0597 418.0551 446.3316 471.3393 502.0171 531.0690 537.8679 563.8239 571.3666 590.2073 610.2625 679.6629 714.0879 718.7221 740.2288 751.1022 801.6811 836.5109 841.2905 870.8407 880.5484 916.3673 950.8503 964.1486 986.2305 1016.3478 1021.3984 1034.0751 1043.4828 1044.8667 1075.8841 1109.3750 1122.8832 1152.8817 1169.3419 1190.6455 1194.6427 1208.7050 1246.5230 1278.1540 1291.2120 1296.8457 1322.5421 1343.9615 1384.4878 1405.6411 1411.3346 1435.7991 1448.2921 1452.5105 1458.0329 1465.8772 1473.2217 1481.3964 1498.8527 1576.9814 1599.4895 1621.5009 1622.4777 1659.8050 2886.3538 2911.2077 2975.5368 2991.1747 3035.3933 3056.8561 3067.6206 3077.4440 3087.2426 3119.2630 3121.3119 3128.8262 3147.4015 3162.8797 3521.8023 3678.9286
redmass: 1.7246 3.4480 4.0752 2.5656 2.9066 3.1099 1.1001 3.2882 3.2722 4.2258 3.6010 3.8629 2.8956 3.1632 3.7859 2.8079 3.3388 1.1522 3.9549 3.3332 4.0819 2.6738 1.2019 4.5911 3.8999 3.5537 2.7659 2.9046 3.5660 1.7575 3.3262 4.1260 1.3867 3.0713 1.6934 1.4419 2.0006 1.3079 2.9150 1.9809 2.1775 1.7208 2.0296 1.8016 3.1004 1.3220 1.5324 1.3135 1.1290 2.1312 2.1390 1.7247 1.8474 1.3668 1.6028 2.8283 1.5850 2.8704 1.2333 2.3559 2.3659 1.3193 1.1233 1.9396 1.1050 1.0671 1.1256 1.1295 2.7139 2.4187 6.7425 1.7532 7.0161 6.6626 1.0833 1.0519 1.0422 1.0642 1.0803 1.0907 1.0978 1.0891 1.1001 1.0993 1.0855 1.0898 1.0935 1.0999 1.0446 1.1044
irintensity: 2.6122 2.8865 0.5319 8.7221 3.3226 3.0452 0.3842 3.6560 5.3669 2.6763 2.2598 1.3369 0.7721 13.2713 11.0432 5.4403 3.2559 151.3657 7.6658 5.7762 8.1492 15.4872 122.1114 3.0090 6.3874 2.7730 13.7778 14.3911 13.6079 82.4340 0.6711 10.7131 3.6258 8.4049 37.4006 1.2364 10.2107 0.0772 31.1359 25.1973 4.4139 14.1959 8.2061 26.3747 9.6062 12.4793 18.0450 17.1852 1.2105 2.2072 21.9152 19.6745 27.0929 106.4185 18.8029 129.9276 6.6090 46.3636 66.5638 42.6959 69.9530 17.3047 35.8355 5.9039 3.8738 20.0105 48.7088 5.2978 137.2396 151.4249 1.6567 173.7786 86.5105 161.4355 56.5148 113.3979 9.8264 26.1710 29.3197 16.5401 15.9783 22.7622 14.3473 0.5132 4.2557 13.7651 32.6525 29.4785 52.9282 25.5681
temp: 298.150 k
press: 1.00000 atm
elementType: 8 7 7 6 6 6 6 6 6 6 6 6 6 6 6 6 1 1 1 1 1 1 1 1 1 1 1 1 1 1 1 1
symmnumber: 1
zpe: 691317.1 jmol-1
zpe.correction: 0.263309 hartree
zpe.thermalcorrener: 0.279171 hartree
zpe.thermalcorrenthalpy: 0.280115 hartree
zpe.thermalcorrgfe: 0.218262 hartree
zpe.sumelectzpe: -688.537996 hartree
zpe.sumelectthermal: -688.522133 hartree
zpe.sumelectthermalent: -688.521189 hartree
zpe.sumelectthermalfe: -688.583042 hartree
dipole: -0.5947 0.8222 -3.7941
dipole: 3.9274
quadrupole: -95.7919 -88.9144 -95.3206
quadrupole: -1.7723 17.9677 0.6947
quadrupole: -2.4496 4.4279 -1.9783 -1.7723 17.9677 0.6947
hfenergy: -688.8013044 hartree
pointgroup: C01 [X(C13H16N2O1)]
dipole: -0.2399219 -0.5429166 1.4266143 debye
polarizability: 243.4187255|10.8829434|133.1844575|-10.8082663|4.0612475|111.9682356 unknown
InChI: InChI=1S/C13H16N2O/c1-9(7-13(14)16)12-8-10-5-3-4-6-11(10)15(12)2/h3-7,12H,8,14H2,1-2H3
charge 0 multiplicity 1
32 atoms
O  -4.563438 0.262297 -1.088417
N  0.620383 -0.966901 -0.184147
N  -5.129381 -0.329797 1.077181
C  -0.290441 0.013989 0.484551
C  0.541643 1.344405 0.463191
C  1.977794 0.850408 0.340346
C  1.950421 -0.516349 -0.063214
C  -1.654521 0.113387 -0.198285
C  0.275088 -2.387284 -0.186669
C  3.197189 1.519509 0.503997
C  3.148636 -1.229015 -0.29313
C  -1.656728 0.464024 -1.669155
C  -2.773535 -0.105671 0.560154
C  4.412508 0.816261 0.271874
C  4.377217 -0.540861 -0.122508
C  -4.188174 -0.032937 0.091795
H  -0.4454 -0.294909 1.546035
H  0.349353 1.950756 1.364023
H  0.267982 1.956105 -0.418007
H  0.486036 -2.88518 0.787583
H  0.842837 -2.915195 -0.973067
H  -0.798238 -2.504926 -0.412991
H  3.218889 2.571721 0.811812
H  3.141347 -2.282959 -0.589669
H  -0.741433 0.076184 -2.149624
H  -2.561089 0.086876 -2.168759
H  -1.667946 1.564181 -1.803439
H  -2.630046 -0.362819 1.621102
H  5.373758 1.324163 0.403317
H  5.317003 -1.078656 -0.29459
H  -6.115466 -0.297615 0.820903
H  -4.870348 -0.571994 2.031506
