program: Gaussian 09
title: 000295469
version: EM64L-G09RevD.01
frameworkgroup: C1[X(C12H17ClN2O)]
method: RPBEPBE
basis: SDD
operation: Freq
keyword: #p
keyword: freq=noraman
keyword: PBEPBE/SDD
title: #p freq=noraman PBEPBE/SDD
converged: YES YES NO NO
title: Mulliken charges:
elementType: Cl O N N C C C C C C C C C C C C H H H H H H H H H H H H H H H H H
charge: -0.085638 -0.293558 -0.438530 -0.506703 -0.018273 -0.346602 -0.694596 -0.681148 0.286535 0.345941 0.309309 -0.356330 -0.250817 -0.827807 -0.216866 -0.269125 0.248658 0.201662 0.180262 0.218865 0.194494 0.236255 0.271529 0.217843 0.213713 0.223163 0.313189 0.312565 0.229041 0.229020 0.267120 0.231246 0.255580
chargesum: 0.00000
title: Mulliken charges with hydrogens summed into heavy atoms:
elementType: Cl O N N C C C C C C C C C C C C
charge: -0.085638 -0.293558 -0.167000 -0.193514 0.230385 0.035322 -0.044981 -0.026429 0.286535 0.345941 0.309309 -0.043764 -0.250817 -0.102626 0.014381 -0.013545
polarizability: 2.37060262e+02 -4.28204607e+00 1.58273451e+02 -6.97260996e+00 -6.30298660e-01 9.67448506e+01
1716.lowfreq: -6.1759 0.0007 0.0017 0.0018 3.1885 5.9393 18.8500 27.5003 48.1212
frequency: 17.8069 27.4558 48.1196 70.3138 80.8846 108.5431 120.6787 180.6654 183.2631 196.8756 207.8328 216.9303 237.1876 250.0380 283.1843 289.8089 317.0742 350.5816 366.0070 396.9112 442.6506 475.9957 491.9753 500.2358 542.7122 557.4520 590.4762 627.9337 702.5537 716.0067 747.5243 772.4217 787.8952 795.6606 819.9987 855.6436 908.7878 916.3457 969.5320 987.7341 988.0422 999.7344 1022.9476 1039.3586 1057.2597 1070.2879 1117.0398 1139.6352 1150.4565 1172.2233 1195.0811 1205.3391 1216.5561 1260.8895 1296.6075 1300.3271 1336.2597 1342.2926 1359.9116 1386.5625 1393.1783 1396.7884 1433.0933 1439.9977 1458.3975 1467.5435 1473.6138 1473.9065 1475.7723 1484.8601 1491.4983 1491.7949 1512.5775 1577.4845 1615.4034 1646.9110 2955.0466 2959.9330 2974.1435 2983.7856 3019.5849 3023.5833 3039.5822 3071.2688 3080.2619 3082.7023 3092.3665 3111.1274 3146.2392 3179.5525 3195.8312 3526.3733 3543.9429
redmass: 3.3740 4.3328 5.2354 6.0303 4.4030 1.9145 2.6234 3.8489 1.1601 1.8758 3.5923 1.0902 1.8390 4.2286 2.8100 3.3170 2.6874 1.9808 6.0547 2.9181 2.6686 3.9865 2.8507 3.5068 5.3549 2.4251 1.6504 6.6146 10.9300 2.7389 4.3928 1.5610 1.4769 4.1956 2.1388 2.6591 1.3547 2.2123 1.3190 1.3672 1.6428 1.6379 2.8648 1.4803 3.1645 2.1781 2.4268 1.9432 1.8241 2.1167 1.6003 1.9987 1.9012 1.3118 1.8971 1.4517 1.3615 1.5135 4.3791 1.2171 1.2156 1.2819 2.5650 2.2370 1.1412 1.1411 1.0503 1.2819 1.0833 1.0623 1.4595 1.0533 2.0613 5.4339 6.4906 4.1739 1.0413 1.0627 1.0380 1.0361 1.0939 1.0982 1.0886 1.0968 1.0998 1.0998 1.1001 1.0925 1.0887 1.0951 1.0956 1.0769 1.0751
irintensity: 0.0099 0.2825 5.9493 8.5980 0.5188 0.1140 0.0992 3.7735 0.9134 3.4421 0.7443 0.0489 1.8477 5.0019 3.2745 3.3837 7.4138 16.0770 13.8395 6.2569 2.0648 0.2121 0.8123 1.1893 0.1087 57.1564 124.4706 23.4269 11.5492 5.8978 7.3969 2.9479 69.5192 1.2533 5.1037 16.8645 3.9637 0.8352 11.5697 1.8793 9.5746 97.9921 20.9338 3.3681 4.8712 7.6135 11.5020 12.4162 3.3256 52.3318 16.1987 266.5945 45.9689 99.3414 49.2942 2.6603 16.3057 3.5489 105.9580 16.9390 15.4121 18.5614 103.4369 24.9544 87.3742 145.0211 3.3907 132.7957 67.0663 23.9629 170.4332 15.2794 331.8425 183.0322 36.8154 147.1114 29.7202 41.5511 40.7719 23.4982 17.7016 22.2635 5.1881 30.4576 45.9291 60.9532 41.0142 3.8517 10.7605 3.3109 12.2287 16.4921 17.7970
temp: 298.150 k
press: 1.00000 atm
elementType: 17 8 7 7 6 6 6 6 6 6 6 6 6 6 6 6 1 1 1 1 1 1 1 1 1 1 1 1 1 1 1 1 1
symmnumber: 1
zpe: 709592.8 jmol-1
zpe.correction: 0.270270 hartree
zpe.thermalcorrener: 0.287843 hartree
zpe.thermalcorrenthalpy: 0.288787 hartree
zpe.thermalcorrgfe: 0.223046 hartree
zpe.sumelectzpe: -1111.083097 hartree
zpe.sumelectthermal: -1111.065524 hartree
zpe.sumelectthermalent: -1111.064580 hartree
zpe.sumelectthermalfe: -1111.130321 hartree
dipole: 3.1963 -3.5085 -0.0662
dipole: 4.7466
quadrupole: -103.0978 -98.0069 -107.0055
quadrupole: -10.4150 -0.1713 0.9835
quadrupole: -0.3944 4.6965 -4.3021 -10.4150 -0.1713 0.9835
hfenergy: -1111.3533669 hartree
pointgroup: C01 [X(C12H17Cl1N2O1)]
dipole: -1.3269584 -0.9763864 0.879369 debye
polarizability: 236.5761777|-7.5092021|135.3293397|-9.5795721|-29.3438953|120.1730455 unknown
InChI: InChI=1S/C12H17ClN2O/c1-4-8(2)14-12(16)15-11-7-5-6-10(13)9(11)3/h5-8,14-15H,4H2,1-3H3
charge 0 multiplicity 1
33 atoms
Cl 5.01904 -1.394276 0.564576
O  -1.409632 1.408553 -0.71812
N  -2.425011 -0.216099 0.622169
N  -0.100782 -0.253502 0.354042
C  -3.800124 0.292494 0.427956
C  -4.687311 -0.756663 -0.294503
C  -4.409698 0.729306 1.77929
C  -4.180181 -1.125059 -1.703482
C  -1.316761 0.389307 0.0300
C  1.211046 0.091323 -0.066028
C  2.282652 -0.736535 0.417177
C  1.469783 1.195238 -0.92071
C  3.585576 -0.390467 -0.003138
C  1.993872 -1.913014 1.331023
C  2.794365 1.485634 -1.301232
C  3.874087 0.697191 -0.848702
H  -3.685134 1.176072 -0.225985
H  -5.714091 -0.345543 -0.360461
H  -4.758987 -1.667842 0.337215
H  -5.415409 1.161471 1.627899
H  -4.514842 -0.131707 2.468309
H  -3.775082 1.489662 2.26659
H  -2.311414 -1.029722 1.230852
H  -3.152319 -1.528709 -1.66279
H  -4.828281 -1.886092 -2.174814
H  -4.16003 -0.236779 -2.360831
H  -0.160504 -1.066983 0.967884
H  0.631771 1.800807 -1.268351
H  1.512517 -1.588385 2.275893
H  1.334036 -2.658692 0.842647
H  2.921877 -2.43569 1.605694
H  2.989972 2.338017 -1.960319
H  4.9043 0.916089 -1.140054
