program: Gaussian 09
title: 000295239
version: EM64L-G09RevD.01
frameworkgroup: C1[X(C14H11Cl2NO)]
method: RPBEPBE
basis: SDD
operation: Freq
keyword: #p
keyword: freq=noraman
keyword: PBEPBE/SDD
title: #p freq=noraman PBEPBE/SDD
converged: NO YES NO NO
title: Mulliken charges:
elementType: Cl Cl O N C C C C C C C C C C C C C C H H H H H H H H H H H
charge: -0.064820 -0.041131 -0.255974 -0.470916 0.346335 0.264609 -0.358140 -0.201417 0.258291 0.134387 -0.784063 -0.220057 -0.261824 -0.332595 -0.344077 -0.210345 -0.220000 -0.098878 0.294244 0.314909 0.196390 0.266656 0.263615 0.236066 0.258993 0.280752 0.226172 0.262652 0.260167
chargesum: 0.00000
title: Mulliken charges with hydrogens summed into heavy atoms:
elementType: Cl Cl O N C C C C C C C C C C C C C C
charge: -0.064820 -0.041131 -0.255974 -0.176672 0.346335 0.264609 -0.043231 -0.201417 0.258291 0.134387 -0.057401 0.016009 -0.002832 -0.051844 -0.117905 0.052306 0.040167 -0.098878
polarizability: 3.20712053e+02 -5.15840337e+00 1.85522276e+02 6.64410289e+00 6.29767991e+00 7.87342627e+01
1716.lowfreq: -125.7841 -4.0888 -0.0018 -0.0004 0.0002 2.6673 5.7527 26.8747 30.3480
frequency: -125.7834 26.8396 30.3093 46.6864 74.1146 91.8623 130.6692 174.3837 191.2399 208.5753 240.3981 262.6995 294.6582 314.1604 322.8106 370.7416 397.8569 408.4206 461.8143 482.4248 502.0832 517.3741 538.7122 558.3288 620.5529 625.8192 639.0135 677.6435 716.3050 719.1720 741.2155 781.6989 792.4178 821.1645 844.4890 854.5760 867.8030 914.6719 950.9375 984.4607 991.8523 995.2811 999.4850 1031.8121 1069.0780 1073.7032 1084.9555 1113.4997 1144.3987 1187.5024 1198.7473 1211.1319 1242.8023 1287.6387 1300.0444 1359.9888 1368.6844 1394.3005 1407.3428 1422.3726 1446.4864 1456.0101 1471.9208 1478.3630 1507.6335 1569.4826 1582.9491 1596.2538 1608.7880 1611.9548 2990.2520 3071.3521 3080.9300 3123.1860 3150.2267 3158.8904 3171.3014 3178.5485 3179.3270 3198.6023 3553.7319
redmass: 1.0445 4.2225 6.3433 9.0634 7.3695 6.5515 4.5329 7.5480 9.7315 4.5745 7.3688 5.7476 4.6845 7.5710 4.9954 7.4968 7.2575 2.9036 4.1854 3.7434 3.3936 6.0037 5.3788 3.6164 4.2498 4.2243 1.8540 4.7785 5.0218 3.1410 3.4949 4.9462 1.4760 1.5108 2.2625 2.0876 5.8870 1.3567 1.3750 1.3773 1.3164 1.7869 3.3995 1.4829 2.9311 2.7538 2.9493 1.3761 1.6982 1.1267 1.5538 1.9659 3.0726 1.7380 1.5236 6.5291 5.3511 4.0339 1.4274 2.2140 2.2758 1.0435 1.9112 1.5629 2.0828 7.9564 4.5875 6.2907 7.3705 4.4868 1.0373 1.0980 1.0974 1.0897 1.0887 1.0889 1.0952 1.0973 1.0956 1.0955 1.0748
irintensity: 1.2397 0.3734 0.0433 0.7647 5.4829 1.4698 0.8303 5.6743 1.0807 0.9567 2.4743 4.1301 2.5454 1.1006 2.1936 13.8440 6.2689 0.6546 17.5640 5.0597 0.2178 19.4526 4.7548 6.4719 19.0204 13.2054 41.3285 25.0343 16.2772 5.7191 23.4041 1.6060 76.3292 12.7723 11.1262 32.7915 30.6531 3.8471 1.5686 5.4626 3.9092 26.4296 76.9883 6.4844 7.1172 52.9716 70.1253 11.4595 5.8842 11.5086 7.4582 7.6164 110.1735 45.2574 28.4763 89.0375 0.2249 2.5000 51.8990 245.2508 1.5385 12.3054 112.8067 5.2391 284.1531 68.5615 190.8762 77.2977 11.0987 71.9203 23.3068 8.3528 42.8521 14.3404 9.0003 0.1026 2.5209 2.4541 3.4364 12.9593 22.1892
temp: 298.150 k
press: 1.00000 atm
elementType: 17 17 8 7 6 6 6 6 6 6 6 6 6 6 6 6 6 6 1 1 1 1 1 1 1 1 1 1 1
symmnumber: 1
zpe: 557878.0 jmol-1
zpe.correction: 0.212485 hartree
zpe.thermalcorrener: 0.228178 hartree
zpe.thermalcorrenthalpy: 0.229122 hartree
zpe.thermalcorrgfe: 0.167008 hartree
zpe.sumelectzpe: -1588.944606 hartree
zpe.sumelectthermal: -1588.928913 hartree
zpe.sumelectthermalent: -1588.927968 hartree
zpe.sumelectthermalfe: -1588.990083 hartree
dipole: 0.2942 -2.0083 0.0885
dipole: 2.0317
quadrupole: -127.8680 -116.1794 -121.5541
quadrupole: -3.4081 2.0922 2.5912
quadrupole: -6.0008 5.6878 0.3130 -3.4081 2.0922 2.5912
hfenergy: -1589.1570908 hartree
pointgroup: C01 [X(C14H11Cl2N1O1)]
dipole: 0.1283555 -0.7879599 0.0393943 debye
polarizability: 320.942012|-2.9619855|185.4834112|4.2735824|5.6424151|78.5431677 unknown
InChI: InChI=1S/C14H11Cl2NO/c1-9-12(16)3-2-4-13(9)17-14(18)10-5-7-11(15)8-6-10/h2-8,17H,1H3
charge 0 multiplicity 1
29 atoms
Cl -5.243352 -2.018539 0.217391
Cl 6.362158 -1.178504 -0.033099
O  0.443712 2.251088 -0.031978
N  -0.420569 0.058449 0.04431
C  -1.827186 0.275494 0.006389
C  -2.691673 -0.865165 0.130064
C  -2.365158 1.581779 -0.157741
C  -4.080875 -0.606004 0.069908
C  2.003208 0.396706 -0.027736
C  0.617111 0.993877 -0.012527
C  -2.201535 -2.291791 0.316847
C  -3.759115 1.768233 -0.20893
C  -4.641289 0.672147 -0.096402
C  3.06694 1.219511 0.424161
C  2.297179 -0.907196 -0.507531
C  4.394673 0.748268 0.430779
C  3.622938 -1.392414 -0.512726
C  4.651639 -0.557621 -0.033938
H  -0.129388 -0.911089 0.169137
H  -1.679553 2.426407 -0.234985
H  -1.104208 -2.39847 0.356838
H  -2.599968 -2.717958 1.255098
H  -2.563371 -2.938037 -0.502924
H  -4.164078 2.777309 -0.336215
H  -5.725662 0.802899 -0.133925
H  2.832007 2.234389 0.759727
H  1.513146 -1.547884 -0.929314
H  5.212706 1.380772 0.78645
H  3.852363 -2.391856 -0.892726
