program: Gaussian 09
title: 000022327
version: EM64L-G09RevD.01
frameworkgroup: C1[X(C19H38)]
method: RPBEPBE
basis: SDD
operation: Freq
keyword: #p
keyword: freq=noraman
keyword: PBEPBE/SDD
title: #p freq=noraman PBEPBE/SDD
converged: YES YES NO NO
title: Mulliken charges:
elementType: C C C C C C C C C C C C C C C C C C C H H H H H H H H H H H H H H H H H H H H H H H H H H H H H H H H H H H H H H
charge: 0.042376 -0.453683 -0.450298 -0.449641 -0.402081 -0.403852 -0.381997 -0.392440 -0.389200 -0.383589 -0.390760 -0.382789 -0.388733 -0.382556 -0.383625 -0.371642 -0.354051 -0.356416 -0.696923 0.186522 0.196078 0.189442 0.185484 0.204119 0.193523 0.192271 0.190817 0.194356 0.194831 0.189324 0.186626 0.196894 0.191954 0.201879 0.192221 0.194723 0.190259 0.194791 0.192580 0.195324 0.194198 0.191463 0.192718 0.194446 0.191702 0.193145 0.192365 0.191445 0.188716 0.189313 0.187436 0.187723 0.194678 0.194591 0.209624 0.209615 0.214702
chargesum: 0.00000
title: Mulliken charges with hydrogens summed into heavy atoms:
elementType: C C C C C C C C C C C C C C C C C C C
charge: 0.228898 -0.068162 -0.060695 -0.063847 -0.016908 -0.019698 0.001523 0.001393 -0.002256 0.001461 -0.002856 0.002872 -0.001569 0.002291 0.000184 0.006388 0.021108 0.032854 -0.062982
polarizability: 2.71592730e+02 -5.68459025e-01 1.79512720e+02 8.49610787e-01 -1.89699558e+00 1.67769440e+02
1716.lowfreq: -4.9861 -0.0024 0.0007 0.0012 4.8488 15.0657 17.8611 23.1855 32.2943
frequency: 16.3208 22.8058 30.8238 37.4411 44.1763 52.7933 64.2187 76.9889 90.3153 99.5862 110.2114 124.8002 128.0347 134.5185 145.9355 156.6487 160.0447 186.5811 223.1466 232.8026 236.3401 261.1975 309.2443 320.8704 365.2475 386.3083 419.0264 436.3725 450.7038 462.4167 490.3381 505.1900 556.5484 716.3452 719.2784 721.3271 726.8570 740.0605 761.5519 778.7297 783.5706 804.9249 839.3680 844.1125 871.7138 888.2864 891.4687 901.6662 913.1301 945.8030 955.2635 978.8768 984.0104 987.8174 1006.2881 1021.8880 1025.2341 1036.6705 1043.4111 1051.2498 1057.5871 1061.5473 1067.1062 1076.1582 1079.2175 1081.5875 1081.9279 1094.5914 1101.9012 1117.6667 1123.0903 1157.9206 1180.0994 1184.1324 1196.7806 1203.2203 1218.0991 1226.7077 1238.1074 1247.1319 1252.0872 1257.3332 1259.3453 1270.7226 1271.7924 1275.9417 1281.8447 1282.4185 1288.7923 1289.3740 1292.4570 1297.0408 1298.8212 1305.3336 1312.9634 1322.4828 1334.2683 1336.2212 1340.1242 1341.6735 1343.3176 1351.6655 1352.6299 1354.8833 1357.3366 1357.5532 1360.9885 1389.6020 1453.6732 1458.0198 1458.6722 1459.7060 1461.1462 1461.5141 1462.8607 1463.6373 1463.8928 1465.8476 1468.7164 1470.5339 1474.6769 1476.8584 1477.6362 1479.9150 1483.7915 1486.9239 1488.5964 2929.0787 2941.6826 2947.5387 2947.9376 2948.9039 2949.3886 2949.8877 2950.5538 2951.4324 2954.2941 2956.8240 2958.1701 2961.5689 2961.9775 2962.0966 2964.3425 2964.5510 2967.4159 2971.1889 2980.2936 2982.0967 2984.9538 2987.9056 2991.5781 2998.1443 3005.1827 3012.7236 3015.3495 3022.4588 3023.1062 3023.8025 3027.1482 3032.1938 3038.0843 3038.8634 3043.2045 3067.9576 3069.5918
redmass: 3.6856 3.3385 1.8903 3.6542 1.6844 2.9779 3.4443 1.7594 2.5128 3.1123 1.9081 2.8536 3.1485 2.1710 2.1021 2.1168 2.2257 2.8067 1.7727 1.1484 3.0887 3.7825 2.9120 1.8001 3.3397 2.9452 2.2892 2.8356 2.4238 2.8926 2.6160 2.9512 1.9479 1.0690 1.0652 1.0758 1.1049 1.1578 1.3120 1.6357 1.6188 1.2655 1.2952 2.0892 1.4858 1.9057 1.5582 1.3316 1.8141 1.2543 2.5730 4.5915 3.9945 1.2570 3.8908 1.3313 2.5856 2.0607 1.5412 1.8091 1.2562 2.3362 2.1377 2.2538 2.0079 2.2251 2.1658 1.6940 2.2991 2.5246 2.7368 2.0784 1.8711 1.5224 1.6105 1.3823 1.4595 1.3420 1.3675 1.2838 1.2753 1.2823 1.2836 1.2804 1.2531 1.0213 1.0382 1.2069 1.2347 1.0910 1.1395 1.1196 1.1155 1.3030 1.2639 1.3369 1.3943 1.4067 1.5361 1.5533 1.4798 1.5530 1.6952 1.6109 1.6074 1.5956 1.5389 1.2180 1.0802 1.0769 1.0749 1.0808 1.0755 1.0778 1.0806 1.0692 1.0835 1.0847 1.0824 1.0858 1.0888 1.0926 1.0432 1.0892 1.0923 1.0945 1.0949 1.0801 1.0594 1.0585 1.0584 1.0587 1.0590 1.0620 1.0593 1.0593 1.0596 1.0629 1.0599 1.0596 1.0600 1.0616 1.0647 1.0607 1.0584 1.0366 1.0958 1.0962 1.0968 1.0980 1.1003 1.1019 1.1032 1.1000 1.1021 1.0975 1.0988 1.1044 1.0993 1.1046 1.1035 1.1044 1.1043 1.1007 1.0993
irintensity: 0.0018 0.0030 0.0012 0.0005 0.0017 0.0002 0.0014 0.0043 0.0041 0.0060 0.0018 0.0009 0.0094 0.0023 0.0079 0.0061 0.0022 0.0449 0.0922 0.0007 0.0041 0.1989 0.0714 0.0804 0.0696 0.0247 0.1131 0.0715 0.4041 0.2366 0.1979 0.0858 0.5513 12.5986 9.2584 6.3509 0.6852 1.5620 0.4530 0.0734 0.0694 0.8490 1.0307 6.0313 0.1264 4.5255 11.0800 2.9901 1.0095 0.8725 4.6846 0.7477 0.3647 1.2661 0.9057 0.4216 0.7429 0.3683 0.1628 0.2832 0.2508 0.0545 0.5444 0.3481 0.2970 0.0081 0.4225 6.3499 0.5291 0.4496 12.9248 4.6753 0.9751 5.8231 2.0005 13.7951 0.2445 0.6843 0.0172 2.2021 0.1496 1.6443 1.2097 0.2770 0.5313 0.3889 0.5036 0.3044 0.2511 0.3199 0.5751 0.0951 0.0428 0.0633 0.5771 0.1641 0.1254 0.4439 0.7432 1.1425 0.1582 0.3076 0.0816 1.1892 0.2412 0.2653 1.1013 11.2176 0.8397 0.5472 0.0753 1.4070 0.6416 1.5621 4.2508 0.8743 6.5727 0.9741 13.2585 7.2258 0.9432 1.9128 12.7135 1.6588 2.1304 4.4662 42.6265 5.7173 8.0087 0.0328 0.0600 0.2386 0.8840 23.8290 0.8387 0.0380 2.0164 42.2596 18.7552 9.4937 28.0783 29.3852 80.9237 154.9133 233.4780 36.9211 0.0233 0.3302 1.8066 4.1634 1.5407 0.3222 0.2581 40.7791 37.4011 96.5973 30.1538 0.2886 3.8230 18.1124 121.0228 19.0860 430.7941 98.5313 55.6000
temp: 298.150 k
press: 1.00000 atm
elementType: 6 6 6 6 6 6 6 6 6 6 6 6 6 6 6 6 6 6 6 1 1 1 1 1 1 1 1 1 1 1 1 1 1 1 1 1 1 1 1 1 1 1 1 1 1 1 1 1 1 1 1 1 1 1 1 1 1
symmnumber: 1
zpe: 1389167.0 jmol-1
zpe.correction: 0.529106 hartree
zpe.thermalcorrener: 0.553190 hartree
zpe.thermalcorrenthalpy: 0.554134 hartree
zpe.thermalcorrgfe: 0.471546 hartree
zpe.sumelectzpe: -745.236791 hartree
zpe.sumelectthermal: -745.212707 hartree
zpe.sumelectthermalent: -745.211763 hartree
zpe.sumelectthermalfe: -745.294351 hartree
dipole: -0.0453 0.0303 -0.0782
dipole: 0.0954
quadrupole: -128.0387 -124.8995 -123.1327
quadrupole: 0.1878 -0.2126 1.3739
quadrupole: -2.6817 0.4574 2.2243 0.1878 -0.2126 1.3739
hfenergy: -745.7658971 hartree
pointgroup: C01 [X(C19H38)]
dipole: -0.0177892 0.0108808 -0.0311982 debye
polarizability: 271.5898736|-0.4494027|179.3725202|1.07214|-2.283644|167.9124964 unknown
InChI: InChI=1S/C19H38/c1-2-3-4-5-6-7-8-9-10-11-13-16-19-17-14-12-15-18-19/h19H,2-18H2,1H3
charge 0 multiplicity 1
57 atoms
C  -5.769311 -0.229167 -0.246504
C  -6.981297 -1.131193 0.108759
C  -5.959592 1.179945 0.374409
C  -4.43697 -0.89144 0.192671
C  -8.331537 -0.493704 -0.298815
C  -7.307224 1.82416 -0.032492
C  -8.501721 0.910029 0.328056
C  -3.162603 -0.186189 -0.32594
C  -1.85271 -0.857607 0.145947
C  -0.587385 -0.136086 -0.370771
C  0.734912 -0.737283 0.156433
C  1.985482 0.011527 -0.35761
C  3.31639 -0.547851 0.193292
C  4.555381 0.222935 -0.316268
C  5.89202 -0.314106 0.243038
C  7.12382 0.469882 -0.264005
C  8.463669 -0.055548 0.298819
C  9.692194 0.733497 -0.209473
C  11.02724 0.205843 0.35942
H  -5.748512 -0.112166 -1.354044
H  -6.865151 -2.12068 -0.377639
H  -6.980573 -1.31369 1.205018
H  -5.918992 1.085781 1.481174
H  -5.126118 1.846514 0.080321
H  -4.406284 -0.933855 1.302878
H  -4.427703 -1.945554 -0.157523
H  -8.374074 -0.404975 -1.404594
H  -9.169824 -1.152755 0.001446
H  -7.418499 2.812506 0.455372
H  -7.308036 2.006454 -1.127683
H  -8.563278 0.810354 1.431942
H  -9.452684 1.36832 -0.00733
H  -3.184634 -0.16288 -1.435985
H  -3.154888 0.871261 0.006917
H  -1.834485 -0.878942 1.2560
H  -1.837116 -1.917161 -0.185159
H  -0.638166 0.93481 -0.080916
H  -0.582497 -0.155279 -1.480887
H  0.727443 -0.718518 1.266552
H  0.798656 -1.806443 -0.135714
H  2.003942 -0.025887 -1.467144
H  1.902662 1.085118 -0.085949
H  3.295604 -0.515182 1.302909
H  3.40942 -1.618836 -0.084101
H  4.452632 1.295526 -0.047752
H  4.580464 0.182814 -1.425584
H  6.000844 -1.384921 -0.029392
H  5.865792 -0.277408 1.352413
H  7.010159 1.541489 0.003994
H  7.152055 0.429509 -1.373276
H  8.437276 -0.015143 1.408086
H  8.581107 -1.126554 0.030367
H  9.718512 0.690782 -1.317676
H  9.572679 1.803752 0.056802
H  11.185117 -0.853459 0.081238
H  11.038362 0.266481 1.46423
H  11.888431 0.786671 -0.019577
