program: Gaussian 09
title: 000294107
version: EM64L-G09RevD.01
frameworkgroup: C1[X(C12H7F6NO2)]
method: RPBEPBE
basis: SDD
operation: Freq
keyword: #p
keyword: freq=noraman
keyword: PBEPBE/SDD
title: #p freq=noraman PBEPBE/SDD
converged: NO YES NO NO
title: Mulliken charges:
elementType: F F F F F F O O N C C C C C C C C C C C C H H H H H H H
charge: -0.155304 -0.155465 -0.116054 -0.145161 -0.116815 -0.155814 -0.404945 -0.255804 0.008144 0.014715 -0.620867 0.386195 0.372436 0.200302 0.315645 -0.316551 -0.314402 -0.376230 -0.363825 0.402953 -0.246684 0.277719 0.304267 0.391870 0.238395 0.291813 0.269027 0.270443
chargesum: 0.00000
title: Mulliken charges with hydrogens summed into heavy atoms:
elementType: F F F F F F O O N C C C C C C C C C C C C
charge: -0.155304 -0.155465 -0.116054 -0.145161 -0.116815 -0.155814 -0.013075 -0.255804 0.008144 0.014715 -0.038881 0.386195 0.372436 0.200302 0.315645 -0.078156 -0.022589 -0.107203 -0.093383 0.402953 -0.246684
polarizability: 2.39189175e+02 1.13756781e+01 1.19264156e+02 2.27890477e+01 2.32007409e+01 9.59993344e+01
1716.lowfreq: -9.4539 -3.0290 -0.0004 0.0003 0.0007 2.1371 9.8636 26.5520 28.4264
frequency: 8.3537 26.4522 28.2718 53.7442 71.5184 81.6439 101.1816 134.5988 150.9543 200.8867 202.9993 207.2059 217.4196 250.7782 281.2015 289.5740 309.3638 311.8627 341.1443 392.7227 397.0930 405.0672 433.3136 457.7453 463.8690 487.0154 533.1123 539.3150 553.0673 565.2813 575.8953 616.0295 631.0314 638.3056 682.9910 724.7583 732.3812 764.2719 792.6546 848.7884 856.2431 875.0664 924.8168 981.2959 984.8952 992.8619 999.4992 1009.4056 1013.7137 1049.8793 1060.0032 1088.1777 1104.0923 1126.0613 1154.8491 1170.2291 1192.3940 1209.6529 1242.3017 1271.7436 1309.3202 1340.9287 1367.8264 1414.1775 1422.0086 1435.1307 1495.6746 1542.1856 1576.4158 1616.9436 2179.2995 3004.1423 3102.3108 3127.0881 3156.4397 3160.1038 3175.5515 3179.6364
redmass: 9.3197 4.5959 16.2234 13.6067 8.9422 11.6385 10.9100 11.8303 11.1962 7.7925 8.1868 8.1983 6.0413 8.6327 9.6747 10.8688 10.0827 9.5261 6.0376 4.5434 2.9229 11.5855 9.6656 15.0203 11.3931 14.7422 4.9440 7.2025 10.6000 5.6368 3.3857 9.4429 7.4678 7.4531 7.3571 1.4206 2.2629 4.8725 5.8146 1.3905 4.6718 1.5106 4.5874 1.4299 10.5316 4.0435 3.6149 1.4887 2.5057 9.1056 10.2994 10.4607 5.6843 1.4120 4.0005 5.4452 1.8303 1.8082 2.2244 1.6284 1.3477 1.9352 4.3045 3.3190 1.3882 1.1964 2.4428 5.5117 6.2374 6.1501 12.6306 1.0660 1.0937 1.0678 1.0882 1.0890 1.0969 1.0983
irintensity: 0.8744 0.2863 0.0243 0.8936 2.7305 1.9858 1.5680 5.5392 0.6437 0.9035 2.7231 3.1840 5.0301 0.7775 4.2956 1.8003 1.1027 0.7668 27.5211 0.9983 0.3919 0.9538 4.4996 5.2889 13.1791 3.5632 10.6175 6.7662 7.8894 24.3604 46.0878 20.4022 23.5701 1.1216 14.6746 57.3060 43.0904 1.3505 4.1700 23.0588 40.0288 78.6791 66.4422 1.3930 51.7040 118.4464 79.6163 7.1621 9.6344 11.2310 243.5279 211.2432 2.9431 6.8719 124.9585 521.9211 4.4703 2.2454 208.2983 46.6544 5.8501 77.1212 27.2505 62.1819 174.0074 129.6619 5.2459 61.8466 62.3008 30.1953 3.7160 10.8477 1.4318 630.0907 7.7445 0.6229 5.8681 0.9933
temp: 298.150 k
press: 1.00000 atm
elementType: 9 9 9 9 9 9 8 8 7 6 6 6 6 6 6 6 6 6 6 6 6 1 1 1 1 1 1 1
symmnumber: 1
zpe: 451089.2 jmol-1
zpe.correction: 0.171811 hartree
zpe.thermalcorrener: 0.191095 hartree
zpe.thermalcorrenthalpy: 0.192039 hartree
zpe.thermalcorrgfe: 0.120928 hartree
zpe.sumelectzpe: -1264.184728 hartree
zpe.sumelectthermal: -1264.165444 hartree
zpe.sumelectthermalent: -1264.164500 hartree
zpe.sumelectthermalfe: -1264.235611 hartree
dipole: 2.8682 1.4449 -1.0369
dipole: 3.3748
quadrupole: -160.0242 -116.0673 -122.8050
quadrupole: -5.9695 -6.8054 1.9337
quadrupole: -27.0587 16.8982 10.1605 -5.9695 -6.8054 1.9337
hfenergy: -1264.3565391 hartree
pointgroup: C01 [X(C12H7F6N1O2)]
dipole: -1.1448249 0.5279725 0.4166215 debye
polarizability: 239.8223112|-8.0464252|119.3072391|23.2200999|-22.1587946|95.3231152 unknown
InChI: InChI=1S/C12H7F6NO2/c13-11(14,15)10(21,12(16,17)18)5-9(20)8-3-1-7(6-19)2-4-8/h1-4,21H,5H2
charge 0 multiplicity 1
28 atoms
F  2.062735 0.205728 -2.194478
F  1.430713 -1.737561 -1.216112
F  3.629869 -1.272628 -1.489947
F  3.375227 1.673814 1.664847
F  4.736922 0.66573 0.167553
F  3.167762 2.143544 -0.539874
O  2.760208 -1.028915 1.236089
O  0.195293 -1.48067 1.547925
N  -6.844289 0.462043 -0.702847
C  2.36876 -0.047851 0.266129
C  0.954855 0.5782 0.50248
C  2.401485 -0.705948 -1.161958
C  3.429678 1.094938 0.379886
C  -0.124816 -0.446194 0.873795
C  -1.549507 -0.206227 0.507847
C  -1.992362 0.973685 -0.151362
C  -2.499887 -1.209048 0.853275
C  -3.353031 1.149044 -0.460223
C  -3.857868 -1.044851 0.543167
C  -4.294575 0.13959 -0.117485
C  -5.68711 0.316217 -0.437818
H  0.672523 1.179881 -0.37418
H  1.037695 1.27098 1.363522
H  1.912444 -1.480386 1.565113
H  -1.288946 1.765703 -0.424561
H  -2.142983 -2.109014 1.362958
H  -3.694476 2.056992 -0.965643
H  -4.586217 -1.818198 0.804002
