program: Gaussian 09
title: 000293441
version: EM64L-G09RevD.01
frameworkgroup: C1[X(C11H14N2)]
method: RPBEPBE
basis: SDD
operation: Freq
keyword: #pfreq=noraman
keyword: PBEPBE/SDD
title: #p freq=noraman PBEPBE/SDD
converged: YES YES NO NO
title: Mulliken charges:
elementType: N N C C C C C C C C C C C H H H H H H H H H H H H H H
charge: -0.439440 -0.131424 0.217070 0.117586 -0.395809 0.151856 -0.481733 0.358233 -0.410252 -0.822795 -0.434097 -0.242430 -0.812822 0.217757 0.227175 0.229390 0.226772 0.296973 0.253295 0.303675 0.209106 0.221728 0.232387 0.226821 0.229568 0.225595 0.225815
chargesum: 0.00000
title: Mulliken charges with hydrogens summed into heavy atoms:
elementType: N N C C C C C C C C C C C
charge: -0.142468 -0.131424 0.217070 0.117586 0.049124 0.151856 -0.025571 0.358233 -0.156957 -0.088286 -0.201710 -0.015608 -0.131845
polarizability: 1.80864053e+02 -4.09015446e+00 1.41284699e+02 -1.61414913e+00 1.66876196e+00 7.59397687e+01
1716.lowfreq: -10.1028 -0.0003 -0.0003 0.0005 4.7470 8.2663 51.3438 55.0248 81.7259
frequency: 50.4264 55.0081 81.6761 130.9176 142.9844 167.5609 180.8806 247.7051 286.6678 310.7930 334.1931 357.1662 441.3408 466.0408 509.0722 512.9914 542.8055 604.2664 672.6650 724.8158 739.6797 780.2281 798.5681 820.4951 835.6565 895.3874 916.5764 942.2164 948.2451 979.4168 994.5231 1016.8629 1028.8199 1054.5805 1059.2920 1080.8301 1093.5477 1150.0204 1166.2865 1183.0794 1206.4375 1210.0733 1255.8699 1265.8458 1275.1988 1314.7767 1368.1939 1392.0618 1404.5713 1408.8869 1438.5170 1449.6466 1460.6366 1468.0583 1470.9443 1483.0910 1493.8797 1501.4489 1571.4942 1596.8540 1603.6267 2961.3876 2966.1520 2971.3452 2994.8968 3035.3499 3037.6989 3044.9670 3060.0739 3084.2911 3111.3830 3120.2474 3135.8003 3158.0375 3569.6545
redmass: 1.1992 3.3599 2.2700 2.9128 2.5368 2.3757 1.2854 2.6003 3.6562 4.6575 2.7919 3.8941 1.5112 2.1276 3.8390 3.5504 3.8500 5.2772 4.5710 3.3563 2.3579 5.2517 1.6096 4.1173 1.4634 4.3860 1.3634 3.8652 3.3620 1.3560 1.4263 2.4654 1.4466 1.6552 2.4639 1.6892 2.0806 2.0180 1.1381 1.6404 1.8542 1.2596 1.5964 1.5401 1.6607 1.6791 5.3748 1.2326 1.2371 1.9020 1.7458 1.9786 1.2486 1.1243 1.1823 1.3004 1.0658 1.1282 6.4283 6.5382 6.0653 1.0656 1.0394 1.0378 1.0654 1.0960 1.0954 1.0966 1.1041 1.0984 1.0973 1.0866 1.0906 1.0993 1.0789
irintensity: 0.7730 4.3165 0.8205 0.6264 2.7215 2.1865 4.4550 7.1451 5.1544 0.7324 1.3057 16.0931 100.5998 20.1890 2.1249 3.8507 3.8326 3.7252 4.2164 2.3006 21.9166 1.3067 42.4264 1.0934 0.8757 2.0348 2.9826 25.5219 3.4187 0.3529 9.4116 18.3185 11.6292 0.8536 29.2393 0.9561 14.0081 4.7582 5.3397 1.3218 1.9781 1.4860 6.8235 6.3895 76.3760 14.1781 0.0403 8.1810 53.6455 38.7274 5.1535 49.6869 11.7969 7.0401 9.0055 30.4350 19.0713 9.9162 65.3014 0.5570 14.8504 88.0959 51.1095 23.5750 60.2905 31.8919 43.6197 10.9915 49.2061 23.5227 3.6969 6.4747 18.9387 26.6434 12.5715
temp: 298.150 k
press: 1.00000 atm
elementType: 7 7 6 6 6 6 6 6 6 6 6 6 6 1 1 1 1 1 1 1 1 1 1 1 1 1 1
symmnumber: 1
zpe: 593322.0 jmol-1
zpe.correction: 0.225984 hartree
zpe.thermalcorrener: 0.238462 hartree
zpe.thermalcorrenthalpy: 0.239406 hartree
zpe.thermalcorrgfe: 0.186885 hartree
zpe.sumelectzpe: -536.111413 hartree
zpe.sumelectthermal: -536.098936 hartree
zpe.sumelectthermalent: -536.097991 hartree
zpe.sumelectthermalfe: -536.150512 hartree
dipole: 0.5369 1.4712 1.9006
dipole: 2.4627
quadrupole: -63.2906 -74.5220 -80.4036
quadrupole: 3.6308 3.2470 -0.5235
quadrupole: 9.4481 -1.7833 -7.6649 3.6308 3.2470 -0.5235
hfenergy: -536.3373976 hartree
pointgroup: C01 [X(C11H14N2)]
dipole: 0.1987593 0.3796691 0.8689939 debye
polarizability: 181.0078882|-0.2898468|135.8373367|-5.2015283|17.5195439|81.2432951 unknown
InChI: InChI=1S/C11H14N2/c1-8-4-3-5-10(9(8)2)11-12-6-7-13-11/h3-5,12H,6-7H2,1-2H3
charge 0 multiplicity 1
27 atoms
N  2.272001 0.877666 0.710644
N  2.035469 -0.860739 -0.785751
C  -0.057106 0.240025 0.071824
C  1.414854 0.026101 -0.023127
C  3.668529 0.401349 0.569122
C  -1.017462 -0.813159 -0.052529
C  3.509245 -0.637234 -0.601409
C  -2.406637 -0.49519 0.08676
C  -0.493497 1.57517 0.310455
C  -0.626059 -2.258419 -0.305912
C  -2.811356 0.839123 0.32921
C  -1.861034 1.877083 0.436308
C  -3.459031 -1.584032 -0.02852
H  4.0266 -0.079682 1.502584
H  4.357553 1.224967 0.312459
H  3.923536 -0.240418 -1.547835
H  4.014442 -1.596097 -0.391632
H  1.953192 1.359813 1.551046
H  0.248582 2.379714 0.353004
H  0.461028 -2.36771 -0.421876
H  -0.986344 -2.912195 0.512539
H  -1.096524 -2.62988 -1.237116
H  -3.880234 1.063754 0.427269
H  -2.184885 2.909613 0.606453
H  -3.43021 -2.073814 -1.020802
H  -3.30489 -2.384392 0.720545
H  -4.472463 -1.173314 0.117686
