program: Gaussian 09
title: 000293674
version: EM64L-G09RevD.01
frameworkgroup: C1[X(C12H21NO)]
method: RPBEPBE
basis: SDD
operation: Freq
keyword: #p
keyword: freq=noraman
keyword: PBEPBE/SDD
title: #p freq=noraman PBEPBE/SDD
converged: YES YES NO NO
title: Mulliken charges:
elementType: O N C C C C C C C C C C C C H H H H H H H H H H H H H H H H H H H H H
charge: -0.261596 -0.123385 0.035303 -0.439974 -0.445357 -0.404066 -0.406372 -0.533433 -0.382884 0.192766 0.166857 -0.380484 -0.719463 -0.718734 0.222120 0.187176 0.192925 0.233919 0.177423 0.194954 0.193822 0.195554 0.195040 0.233138 0.233954 0.197264 0.185890 0.225348 0.225178 0.234056 0.225464 0.204084 0.203981 0.225414 0.234117
chargesum: 0.00000
title: Mulliken charges with hydrogens summed into heavy atoms:
elementType: O N C C C C C C C C C C C C
charge: -0.261596 -0.123385 0.257424 -0.059873 -0.034015 -0.015289 -0.015779 -0.066342 0.000270 0.192766 0.166857 0.070043 -0.055859 -0.055222
polarizability: 1.61860117e+02 -4.64853107e+00 1.28008714e+02 6.32564146e-01 2.02772057e+00 1.13248820e+02
1716.lowfreq: -31.1131 -15.5641 -7.0062 -0.0001 0.0002 0.0006 21.0574 32.8175 51.2710
frequency: 13.4792 31.0654 51.0226 64.1561 136.5306 158.4322 204.9924 218.0498 237.9822 254.9656 273.0189 311.8233 319.8365 328.6211 389.9200 416.5480 427.1325 432.8950 459.3709 554.6271 589.2819 593.0722 682.3447 773.5540 786.2710 796.0446 837.7001 844.1498 858.2857 867.5855 897.3331 913.6830 919.7645 924.5892 936.5848 946.7913 962.9747 970.3595 1011.1013 1048.8615 1055.7984 1076.7403 1090.5047 1109.2667 1114.3632 1139.0173 1144.3954 1168.7855 1174.4687 1206.6724 1233.3747 1244.1838 1249.1458 1258.8719 1266.4251 1283.6772 1314.0035 1315.4390 1332.9686 1335.5234 1339.2101 1341.3726 1353.5266 1365.6126 1376.1937 1393.7657 1444.8037 1452.4314 1460.5502 1461.6219 1463.7421 1466.0751 1468.6677 1470.3603 1475.8958 1476.2066 1488.4233 1634.4892 2948.1093 2950.6399 2962.6694 2964.3384 2967.4148 2970.7449 2979.3753 2979.7379 2982.9669 3011.9671 3017.2706 3023.1919 3024.6659 3027.1334 3036.0991 3044.8294 3075.4313 3080.5589 3082.6336 3093.5851 3096.0931
redmass: 2.9136 3.4528 3.2202 3.7310 2.8857 2.8833 1.0871 1.8024 1.3469 2.5358 2.3284 1.7936 2.2321 2.4198 2.3042 2.3066 2.6630 2.8576 2.2659 1.9624 4.0170 4.5003 4.4562 2.3389 1.6221 5.2719 1.5797 2.4511 3.0091 3.8617 1.5233 2.3537 1.6846 4.0311 1.9429 1.2601 2.4686 2.0352 1.3612 1.9314 1.1445 1.4658 2.8101 2.2833 2.1128 1.8778 1.2579 2.3412 1.4901 1.4826 2.3059 2.4290 1.3101 1.2855 1.2803 1.3143 1.2911 1.3637 1.3777 1.4682 1.4794 1.4960 1.6274 1.6237 1.2173 1.2062 1.0983 1.0497 1.0874 1.0910 1.0899 1.0488 1.0801 1.0603 1.0753 1.0955 1.0627 9.5641 1.0624 1.0662 1.0602 1.0653 1.0633 1.0620 1.0789 1.0366 1.0360 1.0981 1.0571 1.0959 1.0964 1.1009 1.1000 1.0992 1.1000 1.0994 1.1088 1.1025 1.0994
irintensity: 0.0955 0.1521 0.1013 0.3490 1.3128 3.7168 0.0204 0.1003 2.1107 0.2607 2.0841 0.1653 4.1950 0.6659 1.4399 0.7783 1.1811 0.1925 3.0236 5.7530 3.0840 4.6006 3.6695 1.1979 0.4984 0.9914 4.2342 4.8437 5.5019 21.0284 16.1303 9.7099 0.2391 50.7725 15.9766 1.5724 31.0815 5.3971 0.1547 2.0248 1.4007 1.2381 15.7530 9.6250 15.1618 21.6206 2.0964 25.7579 2.5755 3.6638 14.4145 10.9548 4.6857 2.9795 2.5483 19.1030 2.6997 22.0992 0.1900 2.6492 0.7287 0.7972 10.8828 10.4945 22.5825 12.1168 13.6455 3.9338 2.0260 5.5679 11.2655 3.7650 22.2637 6.7051 18.9495 1.4366 6.8261 113.3934 23.9398 30.7926 36.8748 33.1229 34.2609 7.9207 30.0018 22.8534 23.5263 45.7927 51.5781 67.5028 53.9547 20.8072 63.7540 88.8827 10.1603 55.4750 12.7207 24.3780 39.2535
temp: 298.150 k
press: 1.00000 atm
elementType: 8 7 6 6 6 6 6 6 6 6 6 6 6 6 1 1 1 1 1 1 1 1 1 1 1 1 1 1 1 1 1 1 1 1 1
symmnumber: 1
zpe: 812329.2 jmol-1
zpe.correction: 0.309400 hartree
zpe.thermalcorrener: 0.324154 hartree
zpe.thermalcorrenthalpy: 0.325098 hartree
zpe.thermalcorrgfe: 0.265959 hartree
zpe.sumelectzpe: -598.729265 hartree
zpe.sumelectthermal: -598.714511 hartree
zpe.sumelectthermalent: -598.713567 hartree
zpe.sumelectthermalfe: -598.772706 hartree
dipole: -1.0902 0.0866 -0.0511
dipole: 1.0948
quadrupole: -77.1561 -89.1380 -87.3238
quadrupole: -2.6790 -0.4987 -2.2058
quadrupole: 7.3832 -4.5987 -2.7845 -2.6790 -0.4987 -2.2058
hfenergy: -599.0386648 hartree
pointgroup: C01 [X(C12H21N1O1)]
dipole: 0.4279821 -0.0400843 -0.0276867 debye
polarizability: 161.8468669|-4.9476861|124.2765641|-1.1350295|-6.4887908|116.9942201 unknown
InChI: InChI=1S/C12H21NO/c1-12(2)9-14-11(13-12)8-10-6-4-3-5-7-10/h10H,3-9H2,1-2H3
charge 0 multiplicity 1
35 atoms
O  1.983704 1.071862 -1.53406
N  1.440247 -0.148897 0.377047
C  -1.46583 0.472929 0.033567
C  -2.775856 1.30083 -0.011562
C  -1.733035 -0.98537 -0.420892
C  -3.901062 0.642153 0.821385
C  -2.855167 -1.648411 0.412768
C  -0.368876 1.152212 -0.820031
C  -4.158332 -0.815476 0.369629
C  2.928849 -0.361303 0.198268
C  1.019692 0.624866 -0.582743
C  3.28306 0.470635 -1.091661
C  3.195243 -1.870138 0.006461
C  3.65816 0.176032 1.448973
H  -1.107063 0.43745 1.083139
H  -3.110471 1.394804 -1.067215
H  -2.584444 2.329591 0.355838
H  -0.799582 -1.572255 -0.339441
H  -2.030003 -0.978836 -1.492187
H  -4.831268 1.238305 0.742476
H  -3.608686 0.643375 1.892063
H  -2.516998 -1.742989 1.465449
H  -3.044293 -2.675831 0.04476
H  -0.350003 2.243101 -0.616509
H  -0.597943 1.053208 -1.899832
H  -4.935009 -1.281845 1.006884
H  -4.553512 -0.810337 -0.667862
H  3.981707 1.301434 -0.893729
H  3.658017 -0.152415 -1.921277
H  2.832152 -2.432292 0.884138
H  2.668726 -2.252602 -0.886278
H  4.2776 -2.065724 -0.1122
H  4.751056 0.029963 1.358925
H  3.45755 1.253427 1.588056
H  3.306464 -0.355759 2.349856
