program: Gaussian 09
title: 000299220
version: EM64L-G09RevD.01
frameworkgroup: C1[X(C22H22O5)]
method: RPBEPBE
basis: SDD
operation: Freq
keyword: #pfreq=noraman
keyword: PBEPBE/SDD
title: #p freq=noraman PBEPBE/SDD
converged: YES YES NO NO
title: Mulliken charges:
elementType: O O O O O C C C C C C C C C C C C C C C C C C C C C C H H H H H H H H H H H H H H H H H H H H H H
charge: -0.245212 -0.305531 -0.189606 -0.189305 -0.225919 0.238835 -0.537486 -0.374489 -0.514382 0.407400 0.169964 -0.371347 -0.383148 0.290166 -0.554212 -0.374803 -0.533392 -0.239590 -0.214748 -0.236287 0.122247 0.280992 -0.339726 -0.346290 -0.246731 -0.229964 -0.223904 0.248127 0.252370 0.228551 0.227522 0.248832 0.257778 0.240867 0.282938 0.233930 0.256753 0.237236 0.232372 0.222416 0.285608 0.226744 0.229458 0.230322 0.249558 0.276784 0.232809 0.232490 0.233003
chargesum: 0.00000
title: Mulliken charges with hydrogens summed into heavy atoms:
elementType: O O O O O C C C C C C C C C C C C C C C C C C C C C C
charge: -0.245212 -0.305531 -0.189606 -0.189305 -0.225919 0.238835 -0.036990 0.081584 -0.007771 0.407400 0.169964 -0.130481 -0.100210 0.290166 -0.063529 0.094804 -0.025368 -0.012847 0.014711 -0.005965 0.122247 0.280992 -0.090168 -0.069506 -0.013922 0.002526 0.009099
polarizability: 2.55483086e+02 -1.72265766e+01 2.45983861e+02 -1.78279252e+01 2.27969778e+01 2.26867441e+02
1716.lowfreq: -5.2615 -2.1247 0.0005 0.0008 0.0009 3.6848 8.6025 15.1122 22.8745
frequency: 8.0623 15.0928 22.8160 36.4895 43.9316 44.3269 59.0895 76.1295 84.8381 96.9807 101.6180 108.6335 123.3593 146.9505 159.8890 184.0091 212.0346 228.4375 257.6432 268.1180 281.0098 309.0120 337.2456 363.2959 388.7040 399.8300 402.8010 416.9028 438.9165 452.8054 466.8548 499.5959 534.8038 550.1199 568.9490 571.4566 608.0699 613.5562 615.9533 645.0915 650.0534 670.4344 696.8015 704.3326 722.3591 752.0924 766.6023 771.1896 778.1009 800.8929 818.9905 846.6505 855.9550 859.2149 863.5178 869.0249 903.9501 912.7995 934.6437 944.4884 976.1365 978.8916 984.0746 989.7958 990.4645 991.9963 1003.4676 1006.4660 1012.0810 1028.1270 1030.8174 1038.7021 1045.4046 1056.3293 1072.6588 1084.9155 1089.6155 1107.6818 1128.6678 1152.0057 1160.6799 1172.7788 1174.1069 1189.5386 1189.6307 1199.7325 1204.6099 1218.5687 1229.1916 1245.4800 1264.0263 1279.6973 1292.5529 1306.1720 1318.0034 1321.3191 1339.1102 1342.2611 1352.0800 1365.0939 1384.2759 1387.6488 1432.7374 1435.4760 1437.4264 1440.5966 1444.1836 1453.7152 1460.3527 1479.9591 1481.2869 1482.8660 1570.0495 1594.9868 1598.9438 1612.6737 1614.8683 1669.1857 1684.0837 2961.2914 2986.8583 3010.9617 3016.2263 3017.0614 3026.7790 3030.9660 3037.9735 3071.9326 3079.8726 3090.7249 3100.3520 3120.9775 3128.6931 3132.3806 3138.8322 3145.9919 3150.0942 3159.2104 3162.5670 3169.4432 3183.7235
redmass: 6.0304 6.3742 4.5337 4.3245 4.6995 4.9356 5.6441 7.0160 3.2671 2.8829 2.5741 4.6842 4.6907 3.5812 3.5684 3.1279 6.4127 3.2986 4.3820 4.2817 4.8154 4.9064 5.0235 6.5165 4.0644 2.8068 2.8549 3.2347 5.2712 3.3485 5.2068 3.7117 3.4948 3.7423 3.2815 2.8856 5.7972 6.4211 6.4390 5.1365 4.6843 4.0451 1.8268 1.8129 2.9640 1.7987 1.8244 2.2125 2.5244 3.7505 2.4781 4.0968 1.5034 1.2859 2.9818 2.1507 2.7271 2.3913 1.4793 1.4121 4.8193 3.3339 1.4163 5.7179 6.0481 1.4062 1.3468 1.9413 1.6934 2.0152 2.1265 3.0306 2.6875 2.4569 2.2730 1.5991 1.8421 1.8981 4.0478 2.5989 1.6194 1.0695 1.0518 1.1163 1.1268 1.4576 1.3819 1.4337 1.7722 1.8646 1.2975 1.2906 1.3194 1.5324 1.3188 1.3592 1.5905 1.4061 1.5271 1.6446 9.1316 9.3347 1.0990 1.9595 2.2243 1.1822 1.0782 1.0842 1.0877 2.1930 1.1266 2.1210 6.6778 6.3424 6.7712 6.4690 6.1190 10.4135 11.5445 1.0648 1.0610 1.0628 1.0619 1.0655 1.0640 1.0925 1.0934 1.1002 1.1026 1.1000 1.1011 1.0864 1.0851 1.0879 1.0881 1.0936 1.0924 1.0960 1.0990 1.1013 1.0957
irintensity: 0.5105 2.1160 0.6489 0.1011 0.2573 2.3510 2.4466 1.9477 1.9186 2.8140 1.3610 0.8894 2.1781 2.3650 0.6059 1.6409 5.0985 8.7659 3.8976 1.6443 0.7196 4.6722 2.2307 3.1236 20.9542 0.0648 0.0513 1.5482 4.6810 3.8417 4.1182 3.4939 0.7983 7.1056 7.5272 16.2952 6.3229 0.0761 0.7402 13.3145 8.3158 4.3103 45.6855 50.2393 20.2249 56.1453 89.0602 19.5757 9.6001 13.1835 10.7189 203.2844 28.8673 5.1256 114.2003 33.6940 24.0604 6.7836 5.8640 3.6092 156.9253 20.4671 6.4162 1.5970 2.9108 0.6167 2.9610 47.5583 36.6860 8.5978 44.3231 264.7069 143.9197 1.3556 61.9998 14.9865 42.6003 32.3992 44.3663 30.9376 11.0283 3.7020 0.0473 4.8783 15.8556 16.6615 13.2171 6.9084 93.1289 62.7201 26.6732 20.3395 14.0687 78.6426 2.6896 33.0891 40.3292 17.1774 16.4236 30.9162 0.0988 2.4613 31.4925 14.4338 14.3737 19.6979 13.7892 8.9958 23.3980 1.0337 15.0178 5.5465 91.8157 1.0685 43.7681 12.3028 0.6235 125.8174 292.7575 24.2750 21.2116 12.9693 24.2936 8.2050 26.1734 6.8795 17.9722 8.1573 19.5637 10.0338 27.9519 4.8593 0.3665 3.0233 5.5055 27.3306 16.7433 23.1412 26.5132 20.1783 4.7293
temp: 298.150 k
press: 1.00000 atm
elementType: 8 8 8 8 8 6 6 6 6 6 6 6 6 6 6 6 6 6 6 6 6 6 6 6 6 6 6 1 1 1 1 1 1 1 1 1 1 1 1 1 1 1 1 1 1 1 1 1 1
symmnumber: 1
zpe: 1019138.7 jmol-1
zpe.correction: 0.388169 hartree
zpe.thermalcorrener: 0.413168 hartree
zpe.thermalcorrenthalpy: 0.414112 hartree
zpe.thermalcorrgfe: 0.328342 hartree
zpe.sumelectzpe: -1225.721285 hartree
zpe.sumelectthermal: -1225.696286 hartree
zpe.sumelectthermalent: -1225.695342 hartree
zpe.sumelectthermalfe: -1225.781112 hartree
dipole: 2.5569 1.1800 -2.9283
dipole: 4.0627
quadrupole: -136.3389 -160.0122 -154.1246
quadrupole: -12.9228 -18.7308 -11.7572
quadrupole: 13.8197 -9.8536 -3.9660 -12.9228 -18.7308 -11.7572
hfenergy: -1226.1094542 hartree
pointgroup: C01 [X(C22H22O5)]
dipole: -1.2412989 0.8683812 0.5098171 debye
polarizability: 243.0928402|5.3605178|211.7733221|-18.6415697|-4.3394175|273.4682255 unknown
InChI: InChI=1S/C22H22O5/c23-19(17-9-3-1-4-10-17)13-7-14-20(24)26-22(16-8-15-21(25)27-22)18-11-5-2-6-12-18/h1-6,9-12H,7-8,13-16H2
charge 0 multiplicity 1
49 atoms
O  -2.502777 -0.90089 -0.847537
O  -1.890242 0.519955 1.030497
O  -2.761993 -0.318972 -3.040892
O  0.075193 -0.747639 0.764387
O  4.484375 1.807522 1.331901
C  -2.78539 -0.591391 0.566287
C  -4.208364 -0.015999 0.679643
C  -4.397282 1.280526 -0.149698
C  -3.428453 1.363675 -1.367238
C  -2.584855 -1.863856 1.381149
C  -2.909613 0.019107 -1.854843
C  -2.629522 -1.778625 2.795073
C  -2.42365 -3.122684 0.75909
C  -0.484312 0.312313 1.093438
C  0.179528 1.577829 1.618365
C  1.71895 1.505841 1.646933
C  2.346714 1.363893 0.247622
C  -2.50751 -2.944141 3.58076
C  -2.306051 -4.287884 1.548573
C  -2.348309 -4.204463 2.958912
C  3.871377 1.509481 0.263345
C  4.629901 1.30445 -1.01978
C  3.989441 0.952963 -2.23908
C  6.041983 1.471629 -1.003343
C  4.746966 0.774241 -3.416508
C  6.797451 1.29295 -2.178335
C  6.150989 0.94377 -3.389422
H  -4.443584 0.159206 1.74254
H  -4.887163 -0.812602 0.324271
H  -4.23059 2.162794 0.490334
H  -5.442425 1.325597 -0.503124
H  -3.890061 1.870671 -2.229189
H  -2.536273 1.948657 -1.074699
H  -2.742436 -0.802448 3.282295
H  -2.370947 -3.175868 -0.331128
H  -0.172504 2.431612 1.006156
H  -0.217873 1.759532 2.636449
H  2.113382 2.415128 2.1346
H  2.041914 0.654841 2.273199
H  1.937082 2.131448 -0.443881
H  2.073327 0.382813 -0.184847
H  -2.534597 -2.870115 4.673546
H  -2.173572 -5.260058 1.06118
H  -2.25364 -5.110353 3.567948
H  2.904406 0.811143 -2.274887
H  6.516335 1.73991 -0.053358
H  4.246248 0.500472 -4.351497
H  7.885027 1.422711 -2.155876
H  6.737499 0.802905 -4.304329
