program: Gaussian 09
title: 000294348
version: EM64L-G09RevD.01
frameworkgroup: C1[X(C18H14O7)]
method: RPBEPBE
basis: SDD
operation: Freq
keyword: #pfreq=noraman
keyword: PBEPBE/SDD
title: #p freq=noraman PBEPBE/SDD
converged: YES YES NO NO
title: Mulliken charges:
elementType: O O O O O O O C C C C C C C C C C C C C C C C C C H H H H H H H H H H H H H H
charge: -0.267975 -0.261928 -0.263949 -0.252481 -0.232310 -0.396860 -0.237272 -0.320911 -0.572647 0.550879 0.130113 -0.518802 -0.424174 0.199967 0.355801 0.158027 0.121409 -0.332940 -0.449343 0.190650 -0.359805 0.169350 -0.204213 -0.328819 -0.203411 0.292473 0.257957 0.262751 0.281299 0.256381 0.251604 0.270114 0.283188 0.240406 0.231851 0.258341 0.243569 0.243674 0.378037
chargesum: 0.00000
title: Mulliken charges with hydrogens summed into heavy atoms:
elementType: O O O O O O O C C C C C C C C C C C C C C C C C C
charge: -0.267975 -0.261928 -0.263949 -0.252481 -0.232310 -0.018823 -0.237272 -0.028438 -0.051939 0.550879 0.130113 -0.237503 -0.167793 0.199967 0.355801 0.158027 0.121409 -0.081337 -0.179229 0.190650 -0.076617 0.169350 0.268043 -0.070478 0.283832
polarizability: 2.60449738e+02 7.29356652e+00 1.91322529e+02 2.14821699e+01 3.92038189e+00 2.05035683e+02
1716.lowfreq: -7.0703 -4.0128 -2.3035 -0.0004 0.0006 0.0008 11.9721 19.3488 20.8814
frequency: 11.7264 19.2887 20.8768 32.7374 35.9957 55.0765 62.4761 74.3419 86.8763 108.2643 128.6842 159.0708 175.2961 213.2155 218.2799 245.7176 273.8185 295.9798 304.1100 349.3676 367.8793 407.4675 413.9100 423.5694 428.0166 456.0068 507.2840 528.7596 563.3452 567.6748 601.7349 614.4409 623.5021 629.7380 650.8284 675.2479 682.4644 694.2357 726.2164 728.1810 744.5666 765.4911 781.0095 783.6089 817.2876 834.2177 835.3382 838.6617 868.8384 878.6424 890.1804 892.2340 926.3072 937.6304 961.9557 971.7368 974.1028 983.6030 987.2249 1039.1824 1060.6448 1061.7736 1064.7203 1070.6593 1084.5631 1120.0855 1125.6349 1130.2476 1137.7149 1171.3782 1187.7391 1202.8637 1221.3551 1242.3049 1253.4104 1264.5845 1266.1453 1298.6822 1316.9119 1351.5413 1363.7462 1364.2225 1386.3199 1405.1237 1431.7189 1441.6598 1448.1913 1472.7908 1476.6285 1485.9791 1487.8977 1567.0239 1601.1924 1610.2294 1626.4643 1629.3308 1646.8352 2980.5221 2999.3233 3020.3975 3049.1770 3064.5745 3101.0532 3104.0916 3156.6775 3161.9960 3162.1343 3181.8762 3184.6158 3186.0966 3505.8884
redmass: 6.4877 3.4449 3.4497 5.6612 9.0865 7.2161 6.5410 2.9072 5.5036 9.6016 6.4929 5.8918 4.1043 6.6619 5.7875 7.3426 5.9623 7.2803 8.4866 5.5913 8.6801 5.0261 3.0024 4.5343 3.4875 4.0023 3.7496 4.1161 5.6331 4.9799 3.6618 2.5083 2.3053 4.0002 6.3665 7.7221 9.5321 4.9567 4.1904 4.1640 6.7717 5.4204 6.3660 5.1646 1.4469 8.8192 1.7128 3.8111 1.7248 4.3276 1.7269 2.5271 3.1948 1.5213 2.5141 6.7035 2.0181 2.6633 3.0289 2.6279 3.7057 3.1773 1.4550 1.4917 2.3536 1.0368 1.1114 1.4649 1.3073 1.5688 1.2972 1.7243 1.5070 3.3522 3.0221 1.5465 1.4401 1.8078 2.2506 1.9515 1.3549 1.2653 4.3042 3.3649 1.2647 3.6033 3.7187 2.2364 1.9641 1.2939 1.4152 9.2449 7.7126 7.7037 8.6226 8.4554 8.3168 1.0652 1.0602 1.0535 1.0908 1.0866 1.1192 1.1111 1.0929 1.0894 1.0893 1.0928 1.0968 1.0964 1.0639
irintensity: 0.6813 6.6323 6.8020 0.3157 2.5611 1.1353 3.1821 10.0997 5.8805 4.2199 3.5812 1.8276 2.1166 0.1418 0.4886 0.2878 3.0166 0.0968 0.0598 3.0169 4.1178 15.4927 4.0783 5.7857 11.0674 2.1893 0.5547 57.4678 9.8409 25.5559 33.9333 56.1641 46.3153 47.8904 4.1601 6.5342 1.2782 26.0000 5.6349 4.9988 8.1947 9.5586 12.3609 30.1807 38.7814 26.3102 41.8923 39.6993 28.6785 8.6995 16.3192 1.6324 4.3998 4.0974 41.3260 135.6700 51.0658 73.3327 31.1994 162.4685 17.5283 168.8272 4.2947 7.0150 30.2429 0.0021 0.6200 11.8286 7.4831 12.0456 8.9324 8.0415 21.3024 168.7426 312.4007 80.4836 65.1707 134.1328 224.1637 5.7724 10.0254 0.7211 8.6164 18.7761 14.5781 48.9189 90.2091 139.6553 63.9818 29.0869 39.3772 203.4555 11.2690 5.2714 21.4087 7.2059 167.0623 25.8843 121.7922 118.0475 2.4240 10.9115 27.3579 33.2685 0.4363 3.5880 0.1766 1.8866 3.2480 4.5292 26.8686
temp: 298.150 k
press: 1.00000 atm
elementType: 8 8 8 8 8 8 8 6 6 6 6 6 6 6 6 6 6 6 6 6 6 6 6 6 6 1 1 1 1 1 1 1 1 1 1 1 1 1 1
symmnumber: 1
zpe: 746531.1 jmol-1
zpe.correction: 0.284339 hartree
zpe.thermalcorrener: 0.306169 hartree
zpe.thermalcorrenthalpy: 0.307113 hartree
zpe.thermalcorrgfe: 0.228128 hartree
zpe.sumelectzpe: -1219.058144 hartree
zpe.sumelectthermal: -1219.036314 hartree
zpe.sumelectthermalent: -1219.035369 hartree
zpe.sumelectthermalfe: -1219.114355 hartree
dipole: -2.4503 -1.4053 -1.2656
dipole: 3.0953
quadrupole: -120.5400 -132.0932 -148.5894
quadrupole: 2.8894 3.2255 3.1676
quadrupole: 13.2009 1.6477 -14.8486 2.8894 3.2255 3.1676
hfenergy: -1219.3424824 hartree
pointgroup: C01 [X(C18H14O7)]
dipole: 1.0109178 -0.4604312 0.499058 debye
polarizability: 262.7083403|-2.1057273|190.3879536|19.5319841|-1.5094587|203.7116557 unknown
InChI: InChI=1S/C18H14O7/c19-13(11-2-4-15-17(6-11)25-9-23-15)7-12(18(20)21)10-1-3-14-16(5-10)24-8-22-14/h1-6,12,20H,7-9H2
charge 0 multiplicity 1
39 atoms
O  -3.660489 -2.056931 2.101423
O  -4.486913 -3.008298 0.058633
O  4.917224 0.034051 1.729442
O  6.052159 -1.015926 -0.1101
O  0.315149 0.943133 -2.265671
O  -3.081642 3.590694 0.066205
O  -1.721828 3.050184 1.866188
C  -1.447601 1.847235 -0.288443
C  0.041241 1.608399 0.063455
C  -2.275622 0.551501 -0.240741
C  0.817523 0.980181 -1.101011
C  -2.524972 -0.083152 1.014519
C  -2.766018 -0.015211 -1.441254
C  -3.256873 -1.269377 0.99105
C  2.192013 0.446903 -0.84075
C  -3.74416 -1.829403 -0.209527
C  -2.051826 2.863486 0.671597
C  -3.516431 -1.223001 -1.445866
C  2.815085 0.558345 0.444345
C  4.09999 0.03881 0.571602
C  2.882086 -0.173251 -1.919841
C  4.773361 -0.578602 -0.507079
C  -4.289321 -3.267354 1.509854
C  4.186262 -0.700453 -1.771942
C  6.178823 -0.64162 1.329626
H  -1.511833 2.255159 -1.310971
H  0.531104 2.570863 0.319021
H  0.120857 0.981375 0.968983
H  -2.170765 0.347085 1.956632
H  -2.541124 0.478624 -2.391048
H  -3.89452 -1.658879 -2.37374
H  2.320732 1.032965 1.294884
H  2.365597 -0.230801 -2.882825
H  -5.270793 -3.42871 1.982107
H  -3.603123 -4.126681 1.631948
H  4.713976 -1.179263 -2.600082
H  6.303008 -1.56139 1.925904
H  7.019367 0.063931 1.440217
H  -3.491105 4.202584 0.737258
