program: Gaussian 09
title: 000291957
version: EM64L-G09RevD.01
frameworkgroup: C1[X(C7H14O2)]
method: RPBEPBE
basis: SDD
operation: Freq
keyword: #pfreq=noraman
keyword: PBEPBE/SDD
title: #p freq=noraman PBEPBE/SDD
converged: YES YES NO NO
title: Mulliken charges:
elementType: O O C C C C C C C H H H H H H H H H H H H H H
charge: -0.285004 -0.440547 -0.050170 -0.471365 -0.098984 -0.471019 -0.291668 -0.381001 -0.691437 0.214434 0.216860 0.260371 0.214241 0.226358 0.231294 0.220868 0.195352 0.248554 0.178586 0.211532 0.225382 0.214355 0.323008
chargesum: 0.00000
title: Mulliken charges with hydrogens summed into heavy atoms:
elementType: O O C C C C C C C
charge: -0.285004 -0.117539 0.164264 0.005866 0.115257 -0.013367 0.124553 0.046138 -0.040168
polarizability: 9.20391634e+01 1.39377028e+00 7.68709461e+01 -2.94546750e+00 -2.33035412e+00 7.03504520e+01
1716.lowfreq: -27.1995 -10.3297 -0.0008 -0.0007 -0.0002 5.1768 57.9201 62.8613 104.5832
frequency: 57.8718 62.6863 104.5127 150.2729 202.3253 230.8256 249.1437 288.3563 315.4536 405.7982 425.4239 489.6194 588.0983 687.0589 765.5272 827.0900 851.0088 864.1681 880.6216 914.7290 933.2105 942.2773 998.8400 1022.9077 1037.6753 1058.9579 1071.6526 1104.2056 1128.9899 1147.4523 1168.0136 1201.5248 1225.6422 1244.2550 1255.0807 1291.4140 1299.0441 1312.6730 1334.0845 1343.3036 1350.4862 1365.9172 1390.6769 1463.8834 1467.0682 1473.9483 1474.4938 1487.2701 1489.1213 2949.0240 2965.6130 2970.5484 2980.4466 3012.6455 3015.2559 3032.7149 3046.2953 3062.7894 3074.8258 3080.3993 3084.4007 3094.2523 3536.5182
redmass: 2.6911 3.6892 2.4690 2.4150 1.3161 1.7270 3.6983 1.1142 2.8264 3.0964 3.5943 2.4023 2.0104 5.2433 1.4370 2.1184 2.1211 2.2760 2.0763 2.6148 2.3066 2.0517 2.0514 3.9448 1.6176 1.5557 1.7122 1.8265 1.6190 1.5017 1.7009 1.4290 1.3818 1.3677 1.2481 1.2487 1.3963 1.2478 1.3052 1.4293 1.1759 1.5813 1.2135 1.0749 1.0879 1.0439 1.0863 1.0573 1.0957 1.0682 1.0750 1.0748 1.0359 1.0603 1.0677 1.0854 1.0930 1.0981 1.0996 1.1015 1.0996 1.1041 1.0657
irintensity: 3.3965 3.6698 1.9164 2.5366 2.3442 0.9948 3.6361 136.5874 11.4083 2.8012 6.7780 15.1798 7.6667 4.6730 1.2300 17.8167 11.4699 12.9502 32.8271 9.2331 15.2430 39.6772 2.0366 79.4478 15.2531 46.8824 4.2949 1.4523 4.4988 6.7322 0.8269 14.7752 3.0743 0.2798 7.2523 5.6379 8.6344 1.0612 2.9067 11.6382 22.2515 8.3121 12.8287 6.2750 10.1108 11.2947 15.7187 13.3117 1.8761 24.3627 84.6349 55.3135 34.1238 25.9260 27.4422 25.7329 15.4625 33.6899 58.5736 22.9481 37.1549 42.7704 3.5605
temp: 298.150 k
press: 1.00000 atm
elementType: 8 8 6 6 6 6 6 6 6 1 1 1 1 1 1 1 1 1 1 1 1 1 1
symmnumber: 1
zpe: 528452.7 jmol-1
zpe.correction: 0.201277 hartree
zpe.thermalcorrener: 0.211511 hartree
zpe.thermalcorrenthalpy: 0.212456 hartree
zpe.thermalcorrgfe: 0.165475 hartree
zpe.sumelectzpe: -424.821727 hartree
zpe.sumelectthermal: -424.811492 hartree
zpe.sumelectthermalent: -424.810548 hartree
zpe.sumelectthermalfe: -424.857528 hartree
dipole: -1.0684 0.3193 -0.5312
dipole: 1.2351
quadrupole: -51.3275 -60.7842 -54.2073
quadrupole: -1.5771 -4.1904 -5.3112
quadrupole: 4.1122 -5.3445 1.2323 -1.5771 -4.1904 -5.3112
hfenergy: -425.0230035 hartree
pointgroup: C01 [X(C7H14O2)]
dipole: -0.4106374 0.1090531 -0.2358276 debye
dipolederiv: -0.8654693 -0.1911911 0.0621835 -0.2395608 -0.5800884 0.0110886 0.1339718 -0.0175878 -0.3976782 -0.7464643 -0.0895301 -0.1250918 -0.1015792 -0.7619582 0.0800503 -0.1705192 0.0775013 -0.1462187 0.3821482 0.1128685 -0.0536818 0.3423898 0.3507038 -0.0360409 -0.0385051 -0.0119895 0.3312285 -0.0648483 0.0247541 0.0794933 -0.0056323 -0.058778 -0.0110017 0.0730348 -0.0436444 0.0569864 0.4374975 0.0786632 -0.0247885 0.1203563 0.5337502 -0.0660193 -0.0206698 -0.073085 0.170477 0.0226404 -0.0414594 0.0861455 0.0226161 -0.0827639 -0.0358881 0.0549328 -0.0015075 0.0536814 0.7141328 0.1835756 -0.0271766 -0.0215952 0.2435152 -0.0209407 -0.1099589 -0.0652477 0.3327671 -0.0575763 0.0703527 -0.0274808 -0.0103115 -0.0574289 -0.0322332 -0.042231 -0.070938 0.1445074 -0.039181 0.0045162 -0.0568633 0.0467929 0.0554214 0.0075477 -0.0390962 -0.0169838 0.0405414 -0.0352347 -0.0431523 0.0962238 -0.0443498 0.0164779 0.0307246 0.0897496 0.0540816 -0.1733752 -0.0625218 0.0612251 -0.0898998 0.0293121 0.059341 0.0412101 -0.0929017 0.0787648 -0.0892399 0.1218121 -0.0763326 -0.0242929 -0.0501717 -0.0582208 -0.0362085 -0.0185208 -0.0579359 0.0608228 0.0375377 -0.0224394 0.0533676 -0.0152046 0.0078727 0.0065421 0.0709393 0.0173185 -0.1273618 0.0534362 -0.0196134 -0.1208286 -0.0050739 0.0373032 0.0030307 -0.0742847 0.000037 -0.1208054 -0.1552429 0.075267 0.060283 0.0737606 0.0758083 -0.0183928 0.0337784 -0.0147544 0.0801421 0.0177765 -0.017508 0.0148993 -0.0616193 -0.0835233 0.1080936 0.0647837 0.140361 -0.0229606 -0.1961283 -0.0746736 -0.0920078 0.0076617 0.0513491 -0.0149138 -0.1381091 -0.0543343 -0.0815073 0.0860394 -0.0701834 -0.0209097 -0.0788658 -0.0759205 -0.0060143 -0.0194917 0.015359 0.078467 0.01812 0.027602 0.0279918 -0.0093216 0.0535225 0.0909608 0.0482527 0.0437729 -0.1956998 0.0520838 -0.0303851 0.0869406 -0.0173714 0.0793237 0.05542 0.0217359 0.0627186 -0.1491143 0.0538203 -0.073951 -0.0137048 -0.1477675 -0.0924848 -0.0263279 -0.01077 0.0116881 0.0795208 -0.1072469 0.1314166 0.0221592 0.1559172 -0.0164457 -0.0390302 0.0452228 -0.0542296 0.0622931 0.3328689 -0.0198216 0.0870389 0.009618 0.3032234 -0.0916571 0.1386564 -0.0193646 0.0125263 unknown
polarizability: 92.242579|1.6204517|76.6759384|-1.8698367|-2.597452|70.3420441 unknown
InChI: InChI=1S/C7H14O2/c1-2-6(8)7-4-3-5-9-7/h6-8H,2-5H2,1H3
charge 0 multiplicity 1
23 atoms
O  -0.91706 -1.185463 -0.620444
O  1.401144 1.745009 -0.072663
C  -0.396571 0.204237 -0.79421
C  -1.543019 1.150674 -0.363943
C  0.885613 0.360187 0.062046
C  -2.371271 0.284479 0.621588
C  -2.272889 -1.114012 -0.017891
C  1.960725 -0.684333 -0.288228
C  3.174142 -0.643972 0.663065
H  -0.133906 0.325688 -1.866012
H  -2.161315 1.43145 -1.23638
H  -1.144164 2.072208 0.090947
H  0.619855 0.288412 1.132696
H  -1.907227 0.28676 1.624512
H  -3.413623 0.631799 0.722436
H  -2.355015 -1.945785 0.702642
H  -3.033541 -1.244282 -0.81501
H  1.482608 -1.681233 -0.271429
H  2.291511 -0.513972 -1.336821
H  2.8775 -0.923287 1.691326
H  3.609449 0.370628 0.705224
H  3.961525 -1.347304 0.336202
H  1.809029 1.833612 -0.97295
