program: Gaussian 09
title: 000292937
version: EM64L-G09RevD.01
frameworkgroup: C1[X(C14H13NO4)]
method: RPBEPBE
basis: SDD
operation: Freq
keyword: #p
keyword: freq=noraman
keyword: PBEPBE/SDD
title: #p freq=noraman PBEPBE/SDD
converged: YES YES NO NO
title: Mulliken charges:
elementType: O O O O N C C C C C C C C C C C C C C H H H H H H H H H H H H H
charge: -0.439889 -0.285204 -0.408426 -0.242042 -0.330852 0.241792 0.372711 0.338758 0.107781 -0.486549 -0.802200 0.153977 -0.803676 -0.352916 0.069387 -0.345462 -0.217445 -0.227788 0.082450 0.278635 0.232461 0.301531 0.240482 0.245136 0.234625 0.243670 0.270352 0.279912 0.241676 0.243006 0.374054 0.390052
chargesum: 0.00000
title: Mulliken charges with hydrogens summed into heavy atoms:
elementType: O O O O N C C C C C C C C C C C C C C
charge: -0.065835 -0.285204 -0.018374 -0.242042 -0.330852 0.241792 0.372711 0.338758 0.107781 -0.207914 -0.027727 0.153977 -0.080245 -0.082563 0.069387 -0.065550 0.024231 0.015218 0.082450
polarizability: 2.34283491e+02 -6.10949604e+00 1.55510503e+02 -1.56976857e+01 -2.91884067e-01 1.29668440e+02
1716.lowfreq: -11.0870 -4.9868 -0.0010 -0.0009 -0.0009 1.1725 21.8203 28.9227 41.6479
frequency: 21.6169 28.8456 41.6245 72.9549 73.1303 100.7408 116.6418 125.0856 136.2673 151.7832 174.3052 214.4554 246.2945 266.0982 287.5623 303.7651 355.4835 373.6630 388.7382 425.6241 448.5671 494.4802 529.5368 554.7057 580.1726 592.7699 597.7849 604.0771 629.5640 636.8975 658.2989 684.5214 694.4315 741.4407 750.2997 767.2603 790.7277 806.6420 835.6571 901.5490 974.2910 976.8016 981.6039 1001.1347 1007.6457 1013.3936 1038.0166 1041.1493 1048.5655 1055.5723 1098.9154 1135.8211 1157.1648 1160.8522 1176.4911 1241.5590 1263.7606 1275.2575 1320.5883 1325.9766 1367.8165 1381.4792 1399.6426 1405.0152 1412.3104 1442.0851 1458.4750 1463.2570 1472.2455 1484.3814 1486.1115 1549.9367 1576.0027 1589.9799 1607.3781 1627.5842 1645.7828 2969.6227 2971.5254 3041.2686 3042.0001 3096.4841 3108.8461 3139.7714 3151.9918 3162.4411 3175.1312 3236.6707 3516.9542 3525.7612
redmass: 6.8271 7.1895 5.9876 7.2467 5.0458 1.1466 1.3044 4.0636 2.5621 2.7943 4.3734 4.5880 4.7943 4.0375 3.8800 3.6789 7.1600 5.4379 6.0831 3.5072 5.2373 4.0968 5.0036 1.3830 3.6902 3.2442 3.2926 1.5670 2.6087 5.0658 5.7724 4.4598 4.0192 5.7153 3.3432 4.3849 1.7715 3.0132 1.3831 1.4205 3.4233 1.5791 1.4655 5.5142 1.3494 4.4468 1.9039 1.4566 1.4914 2.0040 2.1154 1.6031 1.7669 1.6410 1.0805 3.6937 1.6783 2.1265 3.6442 4.0153 5.0992 5.4133 1.4575 1.3197 2.9412 2.4518 1.2069 1.0503 1.1316 1.4761 1.7035 6.1838 7.1718 6.5888 6.5308 8.6734 7.6166 1.0394 1.0386 1.0969 1.0975 1.0964 1.0969 1.0863 1.0901 1.0952 1.1009 1.0987 1.0641 1.0639
irintensity: 0.9034 0.8118 0.1010 0.8197 0.9183 0.4403 0.7142 0.3454 0.0534 2.7404 0.2493 1.4800 1.9750 2.3954 7.2955 1.4816 1.3569 8.7692 9.1759 7.9257 2.4505 4.3384 3.8261 96.5507 1.2951 19.0801 53.4134 63.2655 34.8767 21.0557 5.6425 32.5168 43.5835 25.5969 23.0289 8.8433 33.2814 7.2714 25.0735 1.9433 229.7807 0.5554 24.1038 100.1179 0.8728 105.9437 30.1709 4.5946 7.6904 18.3098 73.9594 153.4936 27.6443 33.5429 1.1672 15.4866 12.3972 11.6697 65.5163 50.9442 34.4877 23.6495 43.1067 3.6083 99.0379 112.2369 16.2132 17.0982 6.5084 47.5791 34.9629 90.2809 11.8665 19.1975 65.9841 282.2447 366.9984 36.7123 41.1090 1.3485 32.1367 18.4823 0.0060 1.9034 7.2693 4.2618 16.9704 2.1715 46.3534 40.0833
temp: 298.150 k
press: 1.00000 atm
elementType: 8 8 8 8 7 6 6 6 6 6 6 6 6 6 6 6 6 6 6 1 1 1 1 1 1 1 1 1 1 1 1 1
symmnumber: 1
zpe: 634060.1 jmol-1
zpe.correction: 0.241501 hartree
zpe.thermalcorrener: 0.259567 hartree
zpe.thermalcorrenthalpy: 0.260512 hartree
zpe.thermalcorrgfe: 0.193630 hartree
zpe.sumelectzpe: -895.606233 hartree
zpe.sumelectthermal: -895.588166 hartree
zpe.sumelectthermalent: -895.587222 hartree
zpe.sumelectthermalfe: -895.654104 hartree
dipole: 3.6067 -2.9773 0.5785
dipole: 4.7125
quadrupole: -104.6786 -110.7941 -106.9336
quadrupole: -6.8217 -10.6736 4.8296
quadrupole: 2.7901 -3.3253 0.5351 -6.8217 -10.6736 4.8296
hfenergy: -895.8477337 hartree
pointgroup: C01 [X(C14H13N1O4)]
dipole: -1.4563952 0.6670696 0.9334513 debye
polarizability: 232.4806399|-18.5606097|142.221874|11.414415|11.7157569|144.75992 unknown
InChI: InChI=1S/C14H13NO4/c1-8-7-11(14(18)19)9(2)15(8)12-6-4-3-5-10(12)13(16)17/h3-7,16,18H,1-2H3
charge 0 multiplicity 1
32 atoms
O  4.681552 -0.188614 0.568926
O  3.988949 0.070972 -1.631934
O  -0.575086 -2.279767 -0.009961
O  -2.344435 -2.658461 -1.456011
N  0.123872 0.344993 0.416794
C  1.149129 0.293502 -0.532167
C  0.64976 0.17014 1.727074
C  -1.268473 0.555702 0.11294
C  2.350396 0.094236 0.185395
C  2.023933 0.015025 1.593137
C  0.904917 0.447782 -2.003749
C  -2.107842 -0.45444 -0.444134
C  -0.230941 0.120095 2.941164
C  -1.79732 1.845942 0.351926
C  3.677518 0.001747 -0.4096
C  -3.451413 -0.127726 -0.773296
C  -3.141009 2.148518 0.045435
C  -3.970391 1.157605 -0.528653
C  -1.708961 -1.872326 -0.710939
H  2.737058 -0.143474 2.398504
H  0.31658 1.356626 -2.231582
H  1.876223 0.509144 -2.51796
H  0.351642 -0.414854 -2.423631
H  0.39214 -0.043153 3.835547
H  -0.803359 1.054491 3.095667
H  -0.962325 -0.708782 2.882304
H  -1.131852 2.611905 0.762933
H  -4.07151 -0.91182 -1.219376
H  -3.531149 3.153365 0.238704
H  -5.010427 1.385523 -0.783068
H  5.554995 -0.242059 0.095494
H  -0.372975 -3.227841 -0.237282
