program: Gaussian 09
title: 000299925
version: EM64L-G09RevD.01
frameworkgroup: C1[X(C24H29ClN2O4)]
method: RPBEPBE
basis: SDD
operation: Freq
keyword: #p
keyword: freq=noraman
keyword: PBEPBE/SDD
title: #p freq=noraman PBEPBE/SDD
converged: YES YES NO NO
title: Mulliken charges:
elementType: Cl O O O O N N C C C C C C C C C C C C C C C C C C C C C C C C H H H H H H H H H H H H H H H H H H H H H H H H H H H H H
charge: -0.027562 -0.262518 -0.278373 -0.154451 -0.332839 -0.395830 -0.378093 -0.470815 -0.232014 -0.002371 -0.145359 0.223973 -0.721443 -0.712683 -0.620757 0.252983 0.525827 0.329436 -0.720000 -0.408539 -0.393776 -0.231202 -0.233654 -0.257076 -0.483896 0.466605 -0.385154 -0.382638 -0.232719 -0.222940 -0.225448 0.222627 0.236426 0.288913 0.197433 0.277572 0.211102 0.216957 0.224501 0.216088 0.210909 0.213930 0.357084 0.228585 0.244777 0.331451 0.283507 0.319096 0.247540 0.225490 0.229666 0.224644 0.226154 0.227402 0.242664 0.270517 0.237501 0.236496 0.229773 0.234520
chargesum: 0.00000
title: Mulliken charges with hydrogens summed into heavy atoms:
elementType: Cl O O O O N N C C C C C C C C C C C C C C C C C C C C C C C C
charge: -0.027562 -0.262518 -0.278373 -0.154451 -0.332839 -0.038745 -0.046641 -0.011763 0.056899 0.195061 0.132213 0.223973 -0.068882 -0.071756 -0.147396 0.252983 0.525827 0.329436 -0.117397 -0.160999 -0.168287 -0.001536 -0.009010 -0.030922 -0.013830 0.466605 -0.114637 -0.145137 0.003778 0.006833 0.009072
polarizability: 3.01542290e+02 -4.60145383e+00 2.82062971e+02 -1.28039795e+01 2.39472119e+01 2.62715538e+02
1716.lowfreq: -4.6926 -0.0012 -0.0011 -0.0005 3.4166 5.2524 9.0188 16.1408 19.8212
frequency: 7.8518 15.8959 19.5266 22.5347 28.9806 32.8569 35.6365 44.4644 48.0047 48.1706 52.0679 61.7529 67.5821 89.6063 93.6729 109.5901 135.7091 144.2706 152.8034 178.1097 194.8987 205.0198 218.4940 221.9349 232.8301 249.6003 258.1240 273.3446 288.7885 316.2167 322.1094 343.4971 354.7677 360.3156 399.3991 402.6287 404.3818 415.2862 429.8491 449.2327 491.6581 511.1225 521.7197 549.8509 555.8487 569.9939 593.7178 616.2355 617.2985 635.3655 658.3807 664.4230 696.3828 703.1400 705.8607 718.6110 745.8193 757.1192 762.1517 801.0132 808.5420 815.9848 818.3854 841.0438 852.6077 856.9332 859.5690 868.4259 877.2751 898.1007 916.7702 931.3446 935.4256 940.9563 946.9564 959.6980 963.5906 976.8615 981.5647 984.6856 990.3190 990.8687 994.8765 997.7140 1001.8895 1024.1592 1026.3673 1027.5988 1054.4873 1086.7486 1090.6593 1106.5384 1112.5651 1139.1462 1144.1109 1157.7613 1170.8174 1174.5667 1177.5333 1188.2760 1189.0621 1196.4815 1204.8511 1215.7469 1221.4281 1222.2571 1239.7585 1257.5513 1271.4297 1275.5415 1294.6202 1302.4953 1311.1430 1328.7042 1330.3226 1334.0146 1338.4181 1348.5242 1351.6504 1352.5663 1382.1944 1383.1250 1385.0543 1399.2941 1411.0158 1440.2046 1441.9292 1451.8419 1458.9698 1463.0251 1468.3977 1471.9413 1478.9053 1483.3031 1483.9835 1484.5663 1492.3339 1504.5462 1592.7671 1593.4240 1597.4194 1612.4770 1614.6476 1621.5485 1652.5263 2962.5402 2969.2668 2972.2663 2987.2434 3000.7805 3003.9475 3006.6149 3029.8707 3040.9093 3054.6349 3061.2087 3064.2006 3068.8198 3069.4401 3074.1144 3110.6432 3112.1281 3113.3286 3120.6825 3124.0852 3131.7857 3136.3623 3143.5656 3147.2323 3154.6469 3162.2006 3168.1817 3345.1466 3558.1649
redmass: 6.6087 4.6960 4.7713 7.7953 4.2675 3.2838 5.0172 5.1566 5.8994 7.6132 4.9608 4.6574 3.7081 4.1351 8.9394 3.4697 4.9349 4.2099 5.6720 4.3760 2.3248 1.6042 3.2581 4.2102 2.6702 2.5133 3.0212 6.6637 5.4602 3.1088 3.8788 2.9002 2.3513 2.9408 2.3490 2.8094 2.8243 2.1247 3.8126 3.8106 3.7941 3.6938 2.3470 2.7404 2.0154 2.5481 4.3332 6.3008 6.3348 5.1229 5.5870 5.5047 8.1902 1.9295 1.9415 4.4613 3.4995 2.0289 2.3784 3.6083 1.3095 2.9104 2.8562 1.9095 1.5337 2.6785 1.2463 2.0304 2.4114 2.5256 1.1817 1.8072 1.4809 2.6009 2.5565 1.6569 1.9117 1.3934 1.5127 2.2615 5.7396 5.4874 1.3535 2.7331 1.3286 2.4722 2.1853 2.3209 2.2244 2.0348 1.5321 2.3856 2.6328 2.3793 1.1381 2.5576 1.0564 1.0546 1.7737 1.1401 1.1220 1.4890 1.6868 2.3424 2.3365 2.3779 1.1709 1.9906 1.3032 1.2777 1.4495 1.3642 1.2768 1.2744 1.2642 1.2984 1.3740 1.4438 1.3548 1.4497 1.2135 7.5703 7.7811 1.2143 1.0948 2.1595 2.1351 1.1916 1.1294 1.1305 1.0678 1.0732 1.5816 1.0991 2.3053 2.1358 1.0543 1.7427 6.1849 6.0416 7.9250 6.0369 6.1361 5.8239 8.9766 1.0832 1.0357 1.0365 1.0655 1.0714 1.0727 1.0802 1.0603 1.0583 1.0986 1.0996 1.1003 1.0996 1.0984 1.0988 1.0875 1.1028 1.1079 1.0879 1.0859 1.0870 1.0911 1.0920 1.0957 1.0961 1.1014 1.1015 1.0834 1.0777
irintensity: 0.3032 0.0707 0.0747 0.1584 0.0313 0.1211 0.0546 1.5272 0.7157 4.3590 1.2319 0.4039 1.0106 6.6557 11.9829 3.3084 2.5412 0.3428 0.9474 6.6793 1.0501 3.2141 1.4621 0.2819 6.4965 7.5364 0.6676 6.0474 5.3005 3.7568 2.6335 2.3672 7.0854 10.3267 0.8922 0.0323 0.0621 2.7584 1.0761 2.9923 15.2981 31.2855 21.7009 72.8666 57.8412 4.9458 29.8075 0.5194 0.7110 6.2398 0.9918 39.9503 19.0190 67.1587 37.9624 20.9729 38.7238 70.3781 40.7154 15.4850 89.7948 5.1479 26.1642 8.3104 21.4901 22.7915 1.8228 12.2694 0.5451 1.2393 5.6681 1.2489 7.8358 37.8449 44.4150 4.6694 1.5152 0.3328 9.5012 63.5983 0.0064 0.5017 0.7440 10.4903 0.2645 47.4626 6.2279 15.1354 33.6339 12.1701 5.6459 7.9941 8.2577 6.5414 4.5873 7.9581 0.6236 0.0074 6.2060 4.7163 4.8312 5.9844 131.2484 2.1262 38.2160 37.3932 11.4104 85.1946 11.1056 24.0250 18.7339 6.6851 13.8318 4.3880 3.4833 18.7364 4.5711 11.4688 6.6331 7.4443 17.7696 0.4034 0.9415 17.9554 21.0365 7.8780 7.3732 67.3082 19.6320 42.9606 27.0009 23.5871 179.5784 8.9997 8.5959 54.4799 18.5441 242.1178 6.0799 0.3581 57.8549 0.9130 5.5296 291.6806 101.2665 21.2378 38.4012 23.7365 11.0700 23.9616 1.9968 5.3903 5.4503 36.0403 5.5383 15.4167 13.2399 20.8414 78.0012 78.5084 10.0060 1.0099 4.0835 5.5853 1.0997 0.6759 20.6199 13.4661 29.5898 21.9914 16.4782 14.4663 203.3350 34.8030
temp: 298.150 k
press: 1.00000 atm
elementType: 17 8 8 8 8 7 7 6 6 6 6 6 6 6 6 6 6 6 6 6 6 6 6 6 6 6 6 6 6 6 6 1 1 1 1 1 1 1 1 1 1 1 1 1 1 1 1 1 1 1 1 1 1 1 1 1 1 1 1 1
symmnumber: 1
zpe: 1274903.8 jmol-1
zpe.correction: 0.485585 hartree
zpe.thermalcorrener: 0.517477 hartree
zpe.thermalcorrenthalpy: 0.518421 hartree
zpe.thermalcorrgfe: 0.415146 hartree
zpe.sumelectzpe: -1800.144624 hartree
zpe.sumelectthermal: -1800.112733 hartree
zpe.sumelectthermalent: -1800.111788 hartree
zpe.sumelectthermalfe: -1800.215063 hartree
dipole: -3.3004 4.4385 2.2711
dipole: 5.9792
quadrupole: -185.7255 -187.4453 -195.6165
quadrupole: 6.1099 3.5572 -10.8884
quadrupole: 3.8703 2.1504 -6.0208 6.1099 3.5572 -10.8884
hfenergy: -1800.6302093 hartree
pointgroup: C01 [X(C24H29Cl1N2O4)]
dipole: -1.8052965 -0.6151498 -1.3770681 debye
polarizability: 290.4900596|-13.5065936|278.7867207|26.758796|13.5475736|277.0440182 unknown
InChI: InChI=1S/C24H29ClN2O4/c1-17(2)13-21(27-24(30)31-16-19-11-7-4-8-12-19)23(29)26-20(22(28)15-25)14-18-9-5-3-6-10-18/h3-12,17,20-21,26-27H,13-16H2,1-2H3
charge 0 multiplicity 1
60 atoms
Cl 5.217209 0.468698 3.380784
O  2.852093 -1.026076 -0.966188
O  -2.584975 -1.464606 0.429448
O  2.793702 2.269316 2.727817
O  -0.82271 -1.104464 1.959836
N  1.553493 0.013963 0.664592
N  -0.449882 -2.011617 -0.161499
C  1.434951 -3.470553 -0.850637
C  0.981927 -2.312192 0.058853
C  0.716105 -4.82148 -0.596788
C  2.217782 1.323256 0.527293
C  1.881519 -1.055555 -0.147457
C  0.955183 -5.350927 0.838014
C  1.184337 -5.859754 -1.644254
C  1.208403 2.484144 0.339029
C  3.116879 1.520365 1.779151
C  0.460799 2.378609 -0.983179
C  -1.246519 -1.495304 0.826495
C  4.413619 0.714308 1.71615
C  -0.90101 1.98985 -1.026793
C  1.127449 2.649275 -2.207116
C  -1.58019 1.868325 -2.261309
C  0.4535 2.530981 -3.441932
C  -0.905472 2.13712 -3.473653
C  -3.554465 -0.930692 1.455865
C  -3.654275 0.578373 1.439779
C  -2.926676 1.35562 2.378006
C  -4.495511 1.232997 0.503358
C  -3.036705 2.764386 2.376666
C  -4.60202 2.641437 0.497324
C  -3.872941 3.409759 1.435549
H  1.307646 -3.164404 -1.908478
H  2.524326 -3.599268 -0.711515
H  1.081582 -2.600245 1.123539
H  -0.377179 -4.674127 -0.726681
H  2.866443 1.23069 -0.366056
H  2.038252 -5.468985 1.035589
H  0.478995 -6.339361 0.97353
H  0.538761 -4.677461 1.60965
H  0.661076 -6.824187 -1.509618
H  2.270956 -6.048746 -1.548759
H  0.993412 -5.508932 -2.675832
H  0.78875 -0.102012 1.350796
H  1.780725 3.430107 0.389911
H  0.50853 2.498193 1.193718
H  -0.86529 -2.20664 -1.074105
H  5.145736 1.260111 1.094053
H  4.247854 -0.278496 1.271132
H  -1.43836 1.791223 -0.092554
H  2.180421 2.959821 -2.194338
H  -2.634711 1.570198 -2.269198
H  0.983904 2.746583 -4.376429
H  -1.430622 2.046677 -4.431378
H  -4.497396 -1.409284 1.147837
H  -3.235679 -1.304868 2.443178
H  -2.268506 0.8499 3.092838
H  -5.067272 0.636691 -0.218604
H  -2.473123 3.35607 3.106315
H  -5.25339 3.138741 -0.229738
H  -3.95644 4.502147 1.432699
