program: Gaussian 09
title: 000289748
version: EM64L-G09RevD.01
frameworkgroup: C1[X(C10H10N2O)]
method: RPBEPBE
basis: SDD
operation: Freq
keyword: #p
keyword: freq=noraman
keyword: PBEPBE/SDD
title: #p freq=noraman PBEPBE/SDD
converged: YES YES NO NO
title: Mulliken charges:
elementType: O N N C C C C C C C C C C H H H H H H H H H H
charge: -0.256519 -0.440882 -0.018612 0.430425 0.489187 -0.369659 -0.357202 -0.452878 -0.356203 -0.526374 0.214212 -0.798962 -0.157203 0.252958 0.230750 0.221763 0.311971 0.263246 0.263229 0.310858 0.238282 0.270341 0.237272
chargesum: 0.00000
title: Mulliken charges with hydrogens summed into heavy atoms:
elementType: O N N C C C C C C C C C C
charge: -0.256519 -0.130024 -0.018612 0.430425 0.489187 -0.116701 -0.126452 -0.231115 -0.044232 0.000101 0.214212 -0.053067 -0.157203
polarizability: 1.91546637e+02 4.24722317e+00 1.21243573e+02 3.11015474e-02 -9.99700292e-03 5.85103767e+01
1716.lowfreq: -63.8610 -0.0008 -0.0007 -0.0004 6.0513 10.1392 19.9294 24.1772 67.7953
frequency: -63.8536 23.4854 67.7796 73.3084 97.8945 153.4654 162.0188 279.4867 301.4230 323.4313 362.9288 365.3297 410.6961 443.8813 513.4435 545.1683 582.9760 629.9151 643.9060 653.8424 715.5636 766.7842 824.7607 834.5122 850.6987 930.4486 930.6923 948.5142 967.0771 985.7673 994.7936 1011.4627 1031.6899 1127.8844 1193.9666 1199.8728 1207.2621 1220.6994 1267.6681 1276.9266 1320.4043 1375.6051 1378.0021 1414.0958 1440.4693 1449.0496 1468.9830 1502.2209 1513.1880 1596.6252 1629.4210 1636.2990 2204.0699 2978.9969 2988.2119 3025.3475 3073.2127 3113.1646 3123.0547 3137.0996 3148.1087 3195.2076 3521.4702
redmass: 1.0613 5.7044 3.9306 3.8714 7.7203 6.2631 3.4872 5.1376 5.7288 3.0691 4.7474 4.8155 2.9512 5.4523 2.5851 5.2390 3.0040 6.7097 1.1814 5.4622 2.9305 4.5955 1.5599 4.8893 1.2779 1.7291 6.3286 4.4217 1.5164 1.6709 1.3403 2.7473 1.6607 1.3568 1.4450 1.6111 1.0896 3.0331 1.9480 1.7419 1.5145 1.9253 1.7989 3.5802 1.0915 1.1338 1.0467 1.8809 2.8828 5.6639 5.4773 5.5922 12.4724 1.0588 1.0384 1.0991 1.0983 1.0893 1.0910 1.0979 1.0954 1.0945 1.0765
irintensity: 0.0437 11.0738 0.3400 12.2554 8.4339 2.3175 2.9575 1.7839 2.8124 1.5842 0.0579 0.4242 0.0000 5.7598 36.2007 3.9787 0.4413 0.1166 62.8776 5.3831 2.5328 0.3078 69.2639 0.2403 7.4819 20.4081 6.9901 1.3695 1.9835 19.9548 2.2252 6.4185 8.1801 15.5599 0.1005 9.2853 0.2882 52.2543 33.5847 5.3856 69.6801 38.4877 146.5655 47.1232 18.4579 43.8644 20.0732 128.1038 295.1315 56.3675 47.4897 107.0236 11.5794 11.0532 8.3373 2.6669 15.0490 18.9322 13.8570 6.9640 5.0186 6.6663 12.2659
temp: 298.150 k
press: 1.00000 atm
elementType: 8 7 7 6 6 6 6 6 6 6 6 6 6 1 1 1 1 1 1 1 1 1 1
symmnumber: 1
zpe: 467463.1 jmol-1
zpe.correction: 0.178047 hartree
zpe.thermalcorrener: 0.189774 hartree
zpe.thermalcorrenthalpy: 0.190718 hartree
zpe.thermalcorrgfe: 0.138726 hartree
zpe.sumelectzpe: -570.866716 hartree
zpe.sumelectthermal: -570.854989 hartree
zpe.sumelectthermalent: -570.854045 hartree
zpe.sumelectthermalfe: -570.906038 hartree
dipole: 2.8628 -1.1362 0.0064
dipole: 3.0801
quadrupole: -91.1806 -71.1793 -78.1923
quadrupole: -27.0737 0.0288 0.0053
quadrupole: -10.9965 9.0048 1.9917 -27.0737 0.0288 0.0053
hfenergy: -571.0447635 hartree
pointgroup: C01 [X(C10H10N2O1)]
dipole: 1.1495346 0.2856754 0.2557509 debye
dipolederiv: -0.7035893 -0.0229506 -0.0443223 0.4995022 -0.8084469 -0.2179214 0.2470779 -0.2627799 -0.4652545 -1.9196748 0.2492626 0.0015042 0.3771173 -0.3829086 0.000548 0.0714869 -0.0095233 -0.3251837 -0.3268453 0.0037019 -0.0056443 0.0935054 -0.2335065 0.0097781 0.0445287 0.0020803 -0.2317261 0.31048 0.0237915 0.0452206 0.1431953 -0.1262319 -0.0244383 0.1121734 -0.0346218 -0.0704395 1.2332354 0.0138947 0.1045295 0.2957986 0.0301314 -0.0147237 0.2625399 -0.0393318 0.1033093 -0.0251102 -0.0039588 0.0064381 -0.0975226 0.0128149 0.069776 -0.0462636 0.0777274 -0.0871589 -0.0529223 0.006438 0.0120563 0.0238346 0.0863958 0.1369508 0.0217804 0.1353317 -0.0769023 -0.3060819 -0.0017159 -0.0099914 0.1406948 0.0059956 0.1290435 0.0698988 0.1170177 -0.1312947 -0.2621603 -0.0004016 -0.009125 -0.1904461 -0.0871536 0.0240804 -0.1147279 0.0400925 -0.1465471 0.1087596 0.0545309 0.0184793 -0.0094631 0.1019586 -0.0826109 -0.017075 -0.0771101 0.2035909 1.842536 -0.1890694 0.0396385 -0.8617568 0.9885426 0.382014 -0.3375768 0.4393818 0.384714 -0.4039679 -0.1030961 -0.0976535 -0.2199744 -0.0658179 -0.0864858 -0.1580226 -0.0757808 0.0023343 0.0438253 -0.098928 -0.0482038 -0.2059692 0.0735617 0.0452538 -0.1081672 0.0544584 -0.017791 0.0440738 0.0709695 0.0304493 0.0920746 0.0385284 -0.0562075 0.0422574 -0.0579413 0.1241242 0.0543316 -0.0662312 -0.0448132 -0.0709789 -0.0200678 -0.0983444 -0.0475392 -0.0979093 0.0858284 0.0233443 -0.0780866 -0.0558792 -0.0761414 -0.0136952 -0.1070002 -0.054649 -0.1072462 0.10081 0.1482087 0.0539303 0.0275226 0.023677 0.1006274 -0.0429052 0.0107196 -0.0400996 0.159207 -0.0443251 -0.0078257 0.0223039 -0.0295496 -0.0220338 0.0332191 0.0676564 0.0487507 0.0953937 -0.0282387 0.0296957 -0.0205011 0.0549045 0.094545 -0.0183132 -0.0639589 -0.0341256 -0.0371438 0.1616277 0.0242936 0.0012694 -0.0211749 0.1422506 -0.0919726 -0.024175 -0.0883757 0.2523215 0.0550156 0.0029423 -0.0247949 -0.0542763 -0.0701984 0.0804883 0.0041255 0.0880644 0.0730505 -0.0067132 0.048889 0.0135041 0.1099919 0.0441829 -0.0374212 0.0456944 -0.0435008 0.1124413 0.054191 -0.0100762 0.0380127 -0.017043 0.1105255 -0.0328076 -0.0277841 -0.0345586 -0.1076834 unknown
polarizability: 189.982451|-12.367134|107.6656385|4.3546573|26.4190501|73.6524974 unknown
InChI: InChI=1S/C10H10N2O/c1-8(13)12-10-4-2-9(3-5-10)6-7-11/h2-5,12H,6H2,1H3
charge 0 multiplicity 1
23 atoms
O  3.453279 -1.294567 -0.634441
N  2.403483 0.578933 0.31811
N  -4.888795 1.560297 0.242389
C  -1.759275 -0.067388 -0.3987
C  1.028385 0.319288 0.055448
C  -1.297346 1.081376 0.284189
C  -0.80718 -1.01507 -0.848108
C  0.080026 1.273555 0.509293
C  0.573407 -0.839139 -0.632028
C  -3.245778 -0.32774 -0.67195
C  3.521991 -0.193722 -0.015028
C  4.847188 0.417982 0.441435
C  -4.153746 0.714809 -0.167045
H  -2.011714 1.830629 0.642734
H  -1.144536 -1.913772 -1.38003
H  0.418151 2.172021 1.041791
H  1.300559 -1.573782 -0.981142
H  -3.548786 -1.292988 -0.219499
H  -3.416298 -0.430448 -1.762172
H  2.593915 1.449885 0.820165
H  5.018895 1.403716 -0.029719
H  5.66289 -0.258548 0.149658
H  4.872584 0.552077 1.538852
