program: Gaussian 09
title: 000017980
version: EM64L-G09RevD.01
frameworkgroup: C1[X(C24H31NO3)]
method: RPBEPBE
basis: SDD
operation: Freq
keyword: #p
keyword: freq=noraman
keyword: PBEPBE/SDD
title: #p freq=noraman PBEPBE/SDD
converged: YES YES NO NO
title: Mulliken charges:
elementType: O O O N C C C C C C C C C C C C C C C C C C C C C C C C H H H H H H H H H H H H H H H H H H H H H H H H H H H H H H H
charge: -0.244739 -0.304709 -0.259433 -0.091733 -0.095411 -0.436699 -0.428815 -0.370443 -0.386874 -0.355112 -0.319770 -0.683092 0.002930 0.189946 0.387160 0.369135 -0.406818 -0.393033 -0.370669 -0.356366 -0.244978 -0.224385 -0.239944 -0.235686 -0.241098 -0.688468 -0.247639 -0.242012 0.239028 0.227483 0.210130 0.208012 0.226956 0.181452 0.202366 0.191761 0.202293 0.243562 0.235565 0.211140 0.178461 0.209686 0.227281 0.207788 0.277353 0.261170 0.242658 0.261744 0.221200 0.238365 0.222912 0.226109 0.222860 0.227115 0.209125 0.225925 0.226090 0.224718 0.228447
chargesum: 0.00000
title: Mulliken charges with hydrogens summed into heavy atoms:
elementType: O O O N C C C C C C C C C C C C C C C C C C C C C C C C
charge: -0.244739 -0.304709 -0.259433 -0.091733 0.143617 0.000914 0.006154 0.013375 0.007179 0.124015 0.069831 -0.038337 0.002930 0.189946 0.387160 0.369135 -0.129465 -0.131863 -0.128011 -0.094621 0.214588 -0.001473 -0.013835 -0.012827 -0.013984 -0.027328 -0.022921 -0.013565
polarizability: 3.06220540e+02 1.50794600e+01 2.70053887e+02 1.11955122e+01 1.07833052e+01 2.42073433e+02
1716.lowfreq: -4.7508 -2.7714 -0.0005 -0.0001 0.0004 5.4711 21.4586 21.7252 26.4021
frequency: 20.8023 21.5195 26.3223 31.1717 39.7728 41.2735 56.6798 60.3140 73.6639 78.3870 97.0398 104.5762 125.1351 140.8464 161.3033 169.7386 199.5111 208.2411 229.0696 238.1429 251.5997 264.8625 280.3827 292.3473 297.1939 307.5532 321.3253 322.4870 333.7800 342.3885 389.1051 401.3074 403.3962 404.2487 418.8319 472.2976 494.4954 505.0113 535.6349 561.0349 589.5409 616.1334 616.3756 641.8906 660.7081 700.6263 704.0520 706.4594 731.6361 737.3913 760.3730 775.9474 793.0312 803.6381 810.8399 822.7974 839.6603 854.5411 856.5997 865.0453 867.9755 891.2081 920.7846 926.4764 931.9174 934.8083 957.0861 958.7323 967.6618 979.7111 981.6768 990.6505 991.3647 996.3490 997.4653 999.0924 1027.0365 1029.4818 1031.7974 1032.7670 1053.8269 1068.3071 1084.4620 1085.3432 1090.2272 1109.1545 1113.2258 1126.3071 1140.0562 1142.1524 1147.5075 1155.9025 1170.7590 1173.4332 1181.8354 1188.0161 1197.2955 1201.7119 1228.8516 1230.8428 1240.3805 1256.3859 1260.0641 1280.2251 1294.5308 1316.5904 1319.0402 1325.7588 1330.0518 1338.8777 1345.4083 1355.7560 1356.9120 1361.3699 1365.0352 1378.3735 1379.1528 1383.0147 1385.2109 1390.5766 1434.4472 1435.4427 1455.5255 1456.8896 1458.4567 1465.6490 1468.2634 1473.9455 1479.7975 1480.6026 1482.1928 1482.5011 1488.9589 1496.7753 1500.6840 1589.8783 1592.0731 1594.8711 1610.7396 1613.9392 2844.9340 2857.2314 2979.5983 2981.9346 2983.5633 2985.2167 2986.2040 2989.6891 3001.0714 3012.4005 3032.4130 3033.2504 3036.3420 3040.1432 3046.7876 3055.7213 3075.9201 3087.2546 3092.8643 3095.9059 3105.3731 3119.4832 3123.4816 3127.8877 3132.1998 3140.8761 3144.8743 3157.7759 3159.6093 3175.0203 3180.7273
redmass: 4.1066 3.8659 3.6359 3.1566 3.3054 3.6671 4.6786 3.4263 3.9504 3.1222 2.6893 3.3046 2.7841 3.0456 3.3386 4.1260 3.0249 1.3379 2.0230 3.5651 3.3401 3.4666 2.7516 4.6675 3.3661 3.8253 2.1890 2.0971 6.6790 4.3659 3.8361 2.8311 2.7084 2.5431 3.4527 3.8799 2.3136 3.9177 3.3822 4.3571 2.0715 6.3837 6.4215 6.1086 5.8596 3.3213 1.7170 2.4752 2.9120 4.0888 1.9744 2.2190 1.2407 2.0204 1.0999 1.6906 3.7048 1.2526 1.2604 2.6045 4.1166 1.5711 1.6055 1.5680 7.1367 2.0365 2.8318 2.9925 3.5394 1.4238 1.3959 5.9574 5.0209 1.4541 1.3229 1.5863 2.3042 2.5341 2.5770 2.1445 1.8035 1.9960 1.5807 2.0931 1.6360 2.2326 1.7729 1.8224 1.7488 1.8956 3.1364 2.5539 1.0521 1.0537 1.4908 1.1732 1.3306 2.3912 1.4818 3.6142 1.4309 1.1547 1.2194 1.2143 1.2871 1.3182 1.4347 1.3259 1.2921 1.3789 1.4882 1.3683 1.3138 1.2853 1.3989 1.4118 7.6180 8.6911 1.2347 1.2702 2.2321 2.2336 1.0897 1.0987 1.0462 1.0495 1.0835 1.0574 1.2423 1.6874 1.2188 1.7658 1.0851 1.0798 1.0839 6.0598 7.3794 7.4184 5.9846 6.1486 1.0720 1.0704 1.0589 1.0552 1.0359 1.0627 1.0714 1.0367 1.0766 1.0879 1.0621 1.0902 1.0889 1.1065 1.1015 1.1029 1.0985 1.0988 1.1005 1.1014 1.1081 1.0846 1.0848 1.0886 1.0885 1.0941 1.0942 1.0995 1.0983 1.0962 1.0948
irintensity: 0.1829 0.0443 0.0741 0.1455 0.2739 0.1252 0.1836 0.2337 0.4760 0.0480 0.8987 2.2158 3.3486 0.1313 1.9881 1.1352 2.4852 0.0976 0.7993 0.5183 3.0972 5.3103 4.8171 1.6466 2.5439 19.2494 0.6156 11.0225 1.4363 1.4806 1.7893 0.2257 5.3319 6.0527 5.0347 7.4568 1.6545 0.9819 13.8855 3.0221 10.4966 0.0406 0.1608 11.0736 19.8610 23.8848 53.6534 33.0434 4.5331 29.7597 45.3654 31.5655 3.9767 1.6556 2.0230 0.8001 2.1597 0.3836 0.2736 0.4400 11.5443 2.3523 18.2022 24.6233 50.5348 5.0648 37.4530 21.3547 88.8939 0.4819 1.0122 0.5068 3.2833 0.8414 0.2310 1.1492 12.7668 73.0488 22.2591 4.5019 27.3501 4.7639 2.3970 10.9999 18.8485 9.1106 19.0773 31.2400 117.6361 79.8248 81.5013 18.8139 0.7235 0.0395 15.6223 17.0901 7.6113 16.6681 10.1640 10.0603 2.5070 1.5452 7.5273 1.7720 8.6899 1.6885 16.2113 3.3330 1.1747 2.5009 4.3133 12.3334 22.1736 1.5611 4.0075 1.5865 0.1116 0.5520 24.0783 25.7296 14.9716 13.1986 5.4659 10.5783 11.4166 6.7136 15.8270 6.3686 18.8754 6.4269 16.5890 6.0168 14.5840 8.4271 5.8157 10.2777 75.9366 75.7459 0.4126 2.5507 48.5904 125.7243 25.6416 29.4541 36.9864 27.0710 23.1798 28.4120 29.9442 21.9706 18.8547 73.4444 39.7365 17.5865 26.7239 68.1490 47.4647 32.6268 37.6490 45.5593 11.1782 1.3292 0.5318 5.5246 5.5059 32.9968 25.4386 33.3786 31.6085 8.8291 5.9090
temp: 298.150 k
press: 1.00000 atm
elementType: 8 8 8 7 6 6 6 6 6 6 6 6 6 6 6 6 6 6 6 6 6 6 6 6 6 6 6 6 1 1 1 1 1 1 1 1 1 1 1 1 1 1 1 1 1 1 1 1 1 1 1 1 1 1 1 1 1 1 1
symmnumber: 1
zpe: 1306462.3 jmol-1
zpe.correction: 0.497605 hartree
zpe.thermalcorrener: 0.525448 hartree
zpe.thermalcorrenthalpy: 0.526392 hartree
zpe.thermalcorrgfe: 0.436537 hartree
zpe.sumelectzpe: -1211.447073 hartree
zpe.sumelectthermal: -1211.419231 hartree
zpe.sumelectthermalent: -1211.418287 hartree
zpe.sumelectthermalfe: -1211.508142 hartree
dipole: 0.3780 0.0378 -0.5531
dipole: 0.6710
quadrupole: -155.7982 -162.7654 -160.0458
quadrupole: 3.2180 -1.7503 -2.4008
quadrupole: 3.7383 -3.2289 -0.5093 3.2180 -1.7503 -2.4008
hfenergy: -1211.9446785 hartree
pointgroup: C01 [X(C24H31N1O3)]
dipole: -0.1407604 0.002981 -0.2233185 debye
polarizability: 306.4886924|16.6751543|272.0977305|-7.3158313|-7.6315797|239.761437 unknown
InChI: InChI=1S/C24H31NO3/c1-3-25-18-12-11-17-22(25)19-27-23(26)24(28-4-2,20-13-7-5-8-14-20)21-15-9-6-10-16-21/h5-10,13-16,22H,3-4,11-12,17-19H2,1-2H3
charge 0 multiplicity 1
59 atoms
O  -0.802571 -0.462941 -0.669909
O  1.123839 0.598682 1.597681
O  -0.135784 1.748882 -0.95291
N  -4.593973 -0.153706 -0.398618
C  -3.177458 -0.22851 0.046327
C  -2.905591 0.847088 1.126333
C  -3.3103 2.263984 0.657578
C  -5.015899 1.181181 -0.891048
C  -4.780204 2.266947 0.180109
C  -2.179409 -0.1414 -1.150273
C  -5.055639 -1.293811 -1.226979
C  -6.559836 -1.587716 -1.053549
C  1.391263 0.143443 0.195121
C  0.10814 0.575271 -0.571796
C  1.528909 -1.388587 0.275532
C  2.684044 0.771088 -0.353837
C  1.11328 -2.102369 1.423591
C  2.771825 1.458399 -1.587568
C  2.061678 -2.099782 -0.827654
C  3.861221 0.600163 0.422547
C  1.179763 2.061202 1.855072
C  1.234768 -3.509622 1.468405
C  4.015774 1.961452 -2.037634
C  2.173041 -3.505981 -0.786337
C  5.097429 1.110778 -0.020205
C  0.761005 2.247489 3.313487
C  1.760213 -4.218083 0.363931
C  5.180592 1.793368 -1.258159
H  -3.029996 -1.225296 0.507386
H  -1.841696 0.813267 1.426284
H  -3.50483 0.575307 2.016665
H  -3.175873 2.985039 1.486399
H  -2.641775 2.598287 -0.160317
H  -4.488227 1.471332 -1.836094
H  -6.092523 1.132683 -1.134692
H  -5.055212 3.256411 -0.233863
H  -5.447959 2.064038 1.040007
H  -2.168377 0.854035 -1.625337
H  -2.39768 -0.922343 -1.89694
H  -4.481641 -2.186122 -0.909904
H  -4.838509 -1.14407 -2.314997
H  -7.187148 -0.747005 -1.400698
H  -6.790657 -1.770371 0.01027
H  -6.847248 -2.481217 -1.638827
H  0.705981 -1.548598 2.2728
H  1.876094 1.621285 -2.19264
H  2.400802 -1.55432 -1.715933
H  3.794584 0.059463 1.373638
H  2.210441 2.425467 1.680312
H  0.498735 2.593319 1.163724
H  0.915174 -4.052831 2.365289
H  4.069065 2.490673 -2.99575
H  2.587152 -4.044188 -1.646556
H  5.995421 0.971685 0.592207
H  0.808422 3.318237 3.5844
H  1.430067 1.687019 3.989455
H  -0.272221 1.892583 3.474456
H  1.851624 -5.309726 0.399598
H  6.141488 2.186949 -1.608379
