program: Gaussian 09
title: 000291290
version: EM64L-G09RevD.01
frameworkgroup: C1[X(C16H20INO5)]
method: RPBEPBE
basis: SDD
operation: Freq
keyword: #p
keyword: freq=noraman
keyword: PBEPBE/SDD
title: #p freq=noraman PBEPBE/SDD
converged: YES YES NO NO
title: Mulliken charges:
elementType: I O O O O O N C C C C C C C C C C C C C C C C H H H H H H H H H H H H H H H H H H H H
charge: 0.098378 -0.238367 -0.256998 -0.255326 -0.306018 -0.299515 -0.422271 -0.176572 -0.402823 -0.535346 0.219923 0.308519 0.171141 0.266572 -0.256489 -0.341970 -0.326313 -0.265581 -0.666052 -0.171162 -0.183162 -0.339993 -0.660271 0.295027 0.236851 0.231004 0.251917 0.283351 0.383442 0.234505 0.231717 0.284078 0.246639 0.235107 0.230773 0.242559 0.231574 0.219923 0.251665 0.248317 0.232343 0.246218 0.222685
chargesum: 0.00000
title: Mulliken charges with hydrogens summed into heavy atoms:
elementType: I O O O O O N C C C C C C C C C C C C C C C C
charge: 0.098378 -0.238367 -0.256998 -0.255326 -0.306018 -0.299515 -0.038829 0.118455 0.065032 -0.000078 0.219923 0.308519 0.171141 0.266572 0.209733 -0.057892 -0.079674 0.200299 0.028005 0.080503 0.065156 -0.339993 0.040975
polarizability: 3.14811850e+02 -1.03899259e+01 2.07191527e+02 -1.74646867e+01 2.48174913e+01 1.57412242e+02
1716.lowfreq: -10.7674 -4.2770 -1.0234 -0.0004 0.0003 0.0006 4.2712 16.1737 20.6062
frequency: -9.0220 15.6215 20.3033 26.8035 30.0486 38.3149 48.1253 61.0221 75.4848 81.7668 94.8684 98.6739 112.4465 148.2489 170.2027 183.3900 208.6097 216.5843 232.1723 234.4772 259.3099 272.2092 315.2342 320.3210 329.3645 351.4930 374.4689 394.0413 404.1106 441.6659 458.8013 470.1248 503.3677 519.8223 571.8232 582.5327 621.4372 658.6801 674.7076 678.3243 734.8154 738.8060 756.5336 773.4609 786.7190 799.6613 815.9111 818.9249 838.5056 839.9187 857.8758 886.1949 919.1632 928.9680 963.5101 989.5597 997.2529 1007.0763 1008.5921 1030.4719 1052.4994 1066.0411 1095.8170 1096.5466 1103.8964 1112.9431 1148.6477 1155.7867 1156.3575 1162.9120 1178.8683 1197.1203 1209.2511 1249.6716 1277.6407 1277.7151 1286.2734 1293.2071 1312.0484 1325.2440 1347.1807 1354.0746 1356.2067 1362.9292 1374.2500 1386.6013 1390.4889 1392.8219 1447.5918 1449.2395 1457.3274 1457.6213 1463.4855 1463.7852 1464.9971 1484.2447 1484.6060 1524.0253 1554.0669 1591.3597 1597.6526 1607.6348 1616.3314 2963.2276 2993.1871 2993.8128 2995.3051 3016.7587 3031.7944 3034.1975 3068.5040 3076.6161 3088.7130 3090.9543 3094.8578 3096.1023 3122.0253 3122.8692 3138.4966 3152.7009 3167.3403 3173.0195 3398.3078
redmass: 4.1422 3.9252 5.4001 3.6597 4.2376 6.0277 4.8194 4.4383 4.7173 4.7393 10.1575 4.4545 4.0317 5.3452 3.4781 2.8939 3.1405 2.7745 1.7751 1.7868 3.5968 3.5314 3.0273 3.3143 3.3905 4.9000 4.9480 3.5812 2.9237 3.2605 5.1251 3.4697 3.4074 3.4802 4.4478 4.1948 7.1100 4.0570 4.8915 6.5174 3.1234 2.5335 2.0417 1.8656 2.2331 3.1857 1.5615 1.5945 2.6377 1.4287 1.5167 3.0295 2.9198 3.0474 1.3745 5.6363 1.3586 2.5527 2.6950 2.8253 2.9572 2.7379 2.1782 2.1509 3.4867 1.3961 1.9617 1.6878 1.6411 2.3074 3.5295 1.1833 1.7604 1.4426 1.1233 1.1218 1.4664 1.3380 1.5270 1.8128 1.3647 1.3075 1.3308 5.2966 1.4845 3.4988 1.2348 1.2342 1.1023 1.0945 1.0969 1.1005 2.0130 1.0743 1.0440 1.0516 1.0513 1.9987 7.1427 5.6126 7.1745 8.2200 5.4941 1.0801 1.0369 1.0645 1.0363 1.0614 1.0600 1.0595 1.0931 1.1028 1.0975 1.0975 1.1024 1.1029 1.1066 1.1068 1.0893 1.0885 1.0956 1.0971 1.0814
irintensity: 0.9187 0.3831 0.2280 0.3150 0.3430 1.2417 0.6590 0.9005 0.5643 0.6471 3.8524 2.4946 2.0464 0.7127 7.3785 0.2059 3.2680 6.3193 1.2133 1.4710 3.2554 3.2908 8.8752 22.7835 24.4199 3.0764 22.0825 4.8510 0.9469 3.4129 5.1148 6.8033 10.8375 4.2199 8.3317 11.4925 0.5554 7.2932 22.0515 8.5187 6.3171 12.1296 54.1023 27.3957 42.0238 42.5494 11.2393 9.9540 8.8324 49.9912 33.9706 40.4404 14.2398 30.9603 3.7301 62.9677 0.8743 38.3540 39.8989 45.2378 30.4712 48.6180 32.4132 20.8550 107.9444 14.3048 183.4146 8.0265 25.2612 80.1821 224.1660 13.4705 57.5852 70.8552 3.4438 8.0686 22.0025 30.0493 16.4845 177.0753 29.7970 1.3625 2.4908 1.2589 28.2348 4.1988 24.5516 21.4428 76.6941 10.3548 16.0340 15.5643 126.5430 39.4988 14.5470 11.5315 14.7688 450.3312 44.9995 112.4196 49.7264 180.8256 183.4249 39.4190 13.9327 17.7717 13.4049 19.9027 28.8766 26.4353 9.9306 14.6006 37.7784 28.7786 2.4682 1.8032 26.2619 34.3571 1.4514 0.8831 6.6727 3.6787 424.4034
temp: 298.150 k
press: 1.00000 atm
elementType: 53 8 8 8 8 8 7 6 6 6 6 6 6 6 6 6 6 6 6 6 6 6 6 1 1 1 1 1 1 1 1 1 1 1 1 1 1 1 1 1 1 1 1
symmnumber: 1
zpe: 885217.0 jmol-1
zpe.correction: 0.337161 hartree
zpe.thermalcorrener: 0.361039 hartree
zpe.thermalcorrenthalpy: 0.361983 hartree
zpe.thermalcorrgfe: 0.278124 hartree
zpe.sumelectzpe: -1062.379796 hartree
zpe.sumelectthermal: -1062.355919 hartree
zpe.sumelectthermalent: -1062.354975 hartree
zpe.sumelectthermalfe: -1062.438834 hartree
dipole: 2.7379 4.4298 2.6339
dipole: 5.8358
quadrupole: -153.8464 -136.2016 -146.1955
quadrupole: 9.4346 5.4535 -6.0480
quadrupole: -8.4319 9.2129 -0.7810 9.4346 5.4535 -6.0480
hfenergy: -1062.7169578 hartree
pointgroup: C01 [X(C16H20I1N1O5)]
dipole: -0.4129676 -1.2371652 1.8895324 debye
polarizability: 303.1568541|44.0870471|188.7829848|14.5632542|-30.5730058|187.475781 unknown
InChI: InChI=1S/C16H20INO5/c1-3-22-14(19)10-9-13(16(21)23-4-2)18-15(20)11-5-7-12(17)8-6-11/h5-8,13,18H,3-4,9-10H2,1-2H3
charge 0 multiplicity 1
43 atoms
I  6.49463 2.484927 -0.410677
O  -2.344125 1.899819 -0.192204
O  -1.066202 -3.319207 2.086869
O  -3.993355 0.262975 -0.360716
O  -0.034291 -1.445014 1.195842
O  -0.117969 1.388192 -2.999174
N  -0.382239 0.208249 -1.015756
C  -1.756579 -0.172249 -1.322942
C  -2.022478 -1.69623 -1.157741
C  -2.206157 -2.257862 0.276722
C  -2.817589 0.656784 -0.569038
C  -0.990584 -2.26948 1.187579
C  0.358823 0.975958 -1.889259
C  1.776529 1.29384 -1.478644
C  -3.321005 2.819752 0.476842
C  2.533984 2.103909 -2.36113
C  2.38334 0.827887 -0.282795
C  0.035081 -3.443384 3.100618
C  -3.345184 2.573176 1.98733
C  3.869325 2.449896 -2.068693
C  3.720077 1.166307 0.024131
C  4.452151 1.974904 -0.872779
C  1.188264 -4.278381 2.540238
H  -1.898379 0.087427 -2.394746
H  -2.963504 -1.920526 -1.690662
H  -1.211474 -2.232894 -1.683273
H  -2.58347 -3.293595 0.219469
H  -3.00331 -1.680097 0.786756
H  -0.005393 -0.164436 -0.13366
H  -4.316062 2.663024 0.024728
H  -2.938099 3.820905 0.224557
H  2.049406 2.450578 -3.279693
H  1.842079 0.194644 0.428605
H  0.366621 -2.429101 3.382621
H  -0.460168 -3.93575 3.952178
H  -3.74602 1.57127 2.215489
H  -2.332548 2.662995 2.416649
H  -3.995042 3.323023 2.475421
H  4.441308 3.074875 -2.760151
H  4.179286 0.802148 0.947491
H  0.833184 -5.268175 2.206039
H  1.672809 -3.766242 1.692081
H  1.948929 -4.433646 3.327575
