program: Gaussian 09
title: 000287421
version: EM64L-G09RevD.01
frameworkgroup: C1[X(C11H14)]
method: RPBEPBE
basis: SDD
operation: Freq
keyword: #p
keyword: freq=noraman
keyword: PBEPBE/SDD
title: #p freq=noraman PBEPBE/SDD
converged: YES YES NO NO
title: Mulliken charges:
elementType: C C C C C C C C C C C H H H H H H H H H H H H H H
charge: -0.127950 -0.090902 -0.548270 -0.603590 -0.722079 0.518946 -0.395622 -0.413696 -0.233018 -0.225765 -0.244194 0.238830 0.216564 0.232692 0.224005 0.195257 0.208810 0.214829 0.207322 0.224026 0.223111 0.230488 0.222162 0.221981 0.226063
chargesum: 0.00000
title: Mulliken charges with hydrogens summed into heavy atoms:
elementType: C C C C C C C C C C C
charge: 0.110880 0.125662 -0.091573 -0.199523 -0.075902 0.518946 -0.172511 -0.183208 -0.010856 -0.003784 -0.018130
polarizability: 1.38412973e+02 1.06715871e+01 1.08130019e+02 1.42360655e+01 -1.14721830e+01 8.72875931e+01
1716.lowfreq: -19.8350 -10.3783 -6.6642 -0.0006 -0.0005 -0.0003 18.1522 48.7776 77.5485
frequency: 17.0891 48.7036 77.5320 176.3247 192.1401 243.0047 292.1335 325.1210 375.6669 402.9543 415.0402 498.1300 580.6445 617.3717 704.8762 739.3263 765.6289 788.8172 806.0185 850.4721 852.3927 869.8513 914.5942 931.0125 973.5342 982.5790 990.0512 992.9649 1024.1223 1026.9621 1048.1603 1072.8985 1082.2757 1099.9763 1119.2896 1170.7320 1177.0348 1186.1832 1198.7326 1213.4243 1223.7042 1289.1563 1316.9096 1326.8770 1381.3023 1390.4674 1403.4752 1439.1523 1461.7376 1471.3641 1472.4636 1477.2892 1482.8132 1592.5349 1613.1996 2968.3940 2974.8674 3028.0057 3059.2519 3061.1665 3081.6921 3094.3022 3099.8371 3112.9896 3115.3269 3130.3003 3141.3709 3160.3381 3184.7897
redmass: 3.3460 3.5374 2.7864 2.3259 1.2948 2.7917 3.3106 2.3129 2.2797 2.7964 2.2668 3.0543 4.2319 6.2754 1.7852 2.0258 2.4004 2.7034 2.2259 1.2448 1.2457 1.7997 1.4451 1.5160 1.3918 1.9155 5.9110 1.3582 1.5630 1.6746 1.8057 1.1532 1.5923 1.7334 1.5492 1.0538 1.8289 1.1223 1.4440 2.4149 1.5302 1.3545 1.4047 1.2601 7.4930 1.2255 1.8150 2.1662 1.3357 1.0996 1.0725 1.1271 2.1749 6.0536 6.1710 1.0355 1.0596 1.1015 1.0980 1.0981 1.0581 1.0910 1.0890 1.0864 1.0867 1.0910 1.0960 1.1015 1.1149
irintensity: 0.0215 0.0202 0.1217 1.1251 0.4413 0.0752 0.2704 0.3877 0.4975 0.0774 0.6338 10.5344 6.8048 0.1078 49.9130 35.6847 12.8722 11.3748 6.8425 8.8534 1.8206 6.0736 2.3739 3.0625 0.0540 4.4991 0.0407 0.5854 15.7608 11.1445 7.5618 8.2130 8.8529 8.0586 1.2827 0.0662 0.8685 0.3760 1.1179 0.3437 3.3578 1.1133 1.3398 0.5406 0.3498 10.0022 0.5475 7.0455 10.3527 6.5858 10.1614 10.2598 15.2167 1.2623 8.9073 45.1297 36.4534 19.8450 31.1947 21.3269 32.0201 9.8360 32.2082 9.2804 7.5823 13.4801 50.8997 23.1638 22.8172
temp: 298.150 k
press: 1.00000 atm
elementType: 6 6 6 6 6 6 6 6 6 6 6 1 1 1 1 1 1 1 1 1 1 1 1 1 1
symmnumber: 1
zpe: 564630.5 jmol-1
zpe.correction: 0.215056 hartree
zpe.thermalcorrener: 0.225681 hartree
zpe.thermalcorrenthalpy: 0.226625 hartree
zpe.thermalcorrgfe: 0.177185 hartree
zpe.sumelectzpe: -426.720599 hartree
zpe.sumelectthermal: -426.709975 hartree
zpe.sumelectthermalent: -426.709030 hartree
zpe.sumelectthermalfe: -426.758470 hartree
dipole: -0.3440 0.0639 0.0638
dipole: 0.3557
quadrupole: -65.2534 -64.6123 -65.6960
quadrupole: 1.5451 2.2759 -3.2011
quadrupole: -0.0662 0.5749 -0.5087 1.5451 2.2759 -3.2011
hfenergy: -426.9356555 hartree
pointgroup: C01 [X(C11H14)]
dipole: 0.1347777 -0.0266808 0.0265714 debye
dipolederiv: -0.0633759 0.0985118 0.0428254 0.0285651 0.0441357 -0.0103353 0.1863681 0.0181102 0.069941 0.1616806 0.0238376 -0.0084708 -0.0013155 -0.0653082 -0.0235384 -0.0258996 -0.0393495 0.1119059 -0.238613 -0.0912815 0.0686339 -0.0999433 -0.1131641 0.0370092 -0.0235231 0.040503 0.0865638 -0.0054941 -0.0439456 0.0044909 0.0670521 0.1661436 0.0112688 -0.0603681 -0.0325133 0.1298144 0.0649816 -0.0101808 -0.0313571 -0.0002603 0.0383358 0.0436487 0.0032408 0.0066576 0.0280594 0.3277468 0.1097253 -0.0590226 0.1586641 -0.0318821 -0.0096014 -0.0869086 0.0063067 -0.0479762 -0.1175297 -0.0411254 -0.0754833 -0.12084 -0.0709778 0.09388 -0.102422 0.0556419 -0.0671609 -0.1917233 0.0226712 -0.0143788 0.0383095 0.0295208 0.0863588 0.0289168 0.1195955 -0.0959956 -0.034887 0.0484211 -0.033786 0.0761156 0.0603004 0.1062017 -0.019332 0.1072298 -0.0609291 0.0160878 -0.0127321 -0.0945945 -0.0276508 -0.0122793 0.0956576 -0.1045036 0.087256 -0.0328404 0.0009953 0.0872699 -0.0669955 0.07146 -0.084309 0.0105511 -0.0575229 0.0125678 -0.1324734 0.0109928 0.0492015 0.0332825 0.0511238 0.0772544 -0.0089175 0.0190088 -0.0180563 -0.1144299 0.0966335 -0.0339457 -0.0897114 -0.0150078 -0.0233582 -0.0297813 -0.0828797 -0.0470243 -0.1114991 -0.0915075 -0.0670667 -0.0685764 -0.0320759 0.0933882 0.0054949 -0.1121085 -0.0293861 -0.0113231 0.0661764 -0.032774 -0.0022166 -0.0585762 0.0377167 0.0847222 0.0653308 0.0989635 -0.0864904 -0.0022216 -0.0198521 0.0671279 -0.0020407 0.0593922 -0.0824032 0.059685 0.0037012 -0.1247363 -0.016843 0.0471846 -0.0013066 0.0171959 -0.1828543 0.0260151 -0.0135078 -0.0320067 0.0705208 -0.1036385 0.1607186 0.0312492 0.1447689 -0.0342046 -0.0024206 0.0538767 -0.0175261 0.0595415 0.0751785 -0.0081668 -0.0464484 -0.0459161 0.0129163 -0.1329015 -0.0631663 -0.0518673 -0.0921831 -0.0374786 -0.1377876 0.0503356 -0.0953758 -0.0469577 0.0602213 0.0250074 0.0648359 0.0614952 0.0111359 0.0534882 0.1243981 0.0485928 0.0564468 -0.0639927 0.1210985 -0.0689682 0.0362493 0.0881718 -0.0874868 -0.0090268 -0.0670825 -0.0637993 -0.0923264 -0.0034368 -0.0813239 0.0859838 0.0710403 -0.0625488 0.0004364 -0.0850066 -0.0657902 -0.1057849 -0.0042659 -0.1074696 0.0835243 -0.0043635 0.0455535 0.1097857 0.0520386 0.053913 -0.0915721 0.1242495 -0.0886642 0.0353027 -0.0831454 -0.0976895 0.0688091 -0.1027951 0.0654208 -0.0074539 0.0730626 -0.0072135 0.1191355 unknown
polarizability: 138.9165753|9.8440121|108.2844135|-13.9193902|11.3218937|86.6295961 unknown
InChI: InChI=1S/C11H14/c1-9-7-11(9)8-10-5-3-2-4-6-10/h2-6,9,11H,7-8H2,1H3
charge 0 multiplicity 1
25 atoms
C  1.813312 0.652369 0.229945
C  2.579683 -0.632105 -0.117328
C  3.28507 0.734913 -0.213976
C  0.701048 1.180761 -0.683625
C  2.96531 -1.62804 0.967385
C  -0.655771 0.560891 -0.369179
C  -1.044775 -0.676531 -0.945441
C  -1.545826 1.188302 0.540456
C  -2.284759 -1.271746 -0.621907
C  -2.787356 0.597253 0.868953
C  -3.16156 -0.636813 0.288741
H  1.621957 0.810015 1.299586
H  2.312793 -1.088512 -1.080081
H  4.043471 0.973695 0.539002
H  3.497738 1.142925 -1.208235
H  0.979728 0.974972 -1.73621
H  0.643444 2.282247 -0.577696
H  3.837236 -2.237723 0.66341
H  3.233219 -1.10659 1.905572
H  2.128234 -2.315165 1.193426
H  -0.371789 -1.173091 -1.655763
H  -1.26465 2.149519 0.989489
H  -2.56934 -2.225608 -1.081129
H  -3.462947 1.099529 1.571081
H  -4.125068 -1.095169 0.538822
