program: Gaussian 09
title: 000286627
version: EM64L-G09RevD.01
frameworkgroup: C1[X(C13H20N4O)]
method: RPBEPBE
basis: SDD
operation: Freq
keyword: #p
keyword: freq=noraman
keyword: PBEPBE/SDD
title: #p freq=noraman PBEPBE/SDD
converged: YES YES NO NO
title: Mulliken charges:
elementType: O N N N N C C C C C C C C C C C C C H H H H H H H H H H H H H H H H H H H H
charge: -0.296855 -0.072384 -0.037470 -0.246920 -0.658395 -0.359446 -0.358087 -0.345156 -0.355106 -0.665353 -0.670033 0.138910 0.104876 -0.300442 -0.332892 -0.212619 -0.247036 0.150385 0.217987 0.235623 0.208658 0.239070 0.213012 0.199467 0.204626 0.239241 0.213169 0.219549 0.228817 0.210054 0.230682 0.211154 0.259607 0.282706 0.225195 0.230285 0.389086 0.306034
chargesum: 0.00000
title: Mulliken charges with hydrogens summed into heavy atoms:
elementType: O N N N N C C C C C C C C C C C C C
charge: -0.296855 -0.072384 -0.037470 -0.246920 0.036726 0.094164 0.089642 0.067323 0.088761 -0.003818 -0.018143 0.138910 0.104876 -0.040834 -0.050186 0.012576 -0.016752 0.150385
polarizability: 2.81921740e+02 1.33676601e+01 1.96587037e+02 -4.86534234e+00 1.33308528e+01 1.03655846e+02
1716.lowfreq: -10.1848 -0.0006 -0.0004 -0.0002 2.7423 10.5161 15.6090 25.8728 44.6590
frequency: 13.6927 25.1704 44.5989 48.9132 67.5881 89.6752 106.1809 117.2135 119.2753 153.9079 185.5903 213.6171 215.2392 236.7113 261.6421 274.4250 305.3974 323.3898 344.4185 385.4947 404.3194 425.6798 460.0301 472.8594 523.1743 537.1180 581.3981 590.2608 602.5872 629.9865 689.5196 725.9689 743.4481 772.1019 773.2830 788.8401 820.3528 847.4076 852.4317 861.6033 884.3630 897.2880 899.6732 928.9451 983.8276 1006.6646 1029.7378 1038.2829 1047.0237 1065.7815 1083.4476 1090.6826 1100.3969 1102.6672 1121.0404 1147.0804 1168.1469 1186.6022 1199.6521 1221.9297 1259.8250 1261.5470 1279.6612 1300.9569 1310.1606 1329.0545 1341.5314 1347.0286 1350.6875 1355.2824 1378.3453 1389.1737 1392.5999 1395.7190 1431.1428 1449.8883 1461.4897 1463.5349 1466.2628 1474.9623 1476.4068 1477.8761 1481.8855 1488.3082 1557.7955 1570.3001 1596.4878 1619.2234 2977.1452 2977.4075 2984.8948 2990.0356 2993.2422 3001.0459 3029.3254 3041.1651 3060.4754 3076.3536 3079.3835 3083.1721 3084.3295 3086.3710 3128.4182 3146.0751 3161.8846 3171.8704 3230.7283 3612.8986
redmass: 4.7704 3.3419 3.2057 3.5027 3.5759 2.6658 3.8361 1.9217 2.2900 3.5349 1.9832 1.3785 2.3612 2.8783 3.8323 2.4231 4.0990 4.4209 4.1897 4.0991 2.5677 3.0919 4.0828 4.6210 3.5550 3.3057 1.3680 4.5496 3.8284 5.0462 3.5437 3.4807 1.1519 2.0716 2.0013 1.8404 2.3871 1.1544 1.7892 1.7617 1.9118 1.5342 1.4430 2.7731 1.3553 1.3293 1.7223 2.3188 2.9743 3.1803 2.2601 1.8265 2.1792 2.2310 2.1266 1.7247 1.1431 2.1721 2.0186 1.8017 1.2848 1.4146 1.3396 1.3326 1.8335 1.9269 1.7129 1.7039 1.9511 1.5564 3.8089 2.2534 1.2076 1.4262 2.4224 1.0813 1.2166 1.1745 1.8472 1.0478 1.0545 1.0429 1.0576 1.0883 1.5223 3.9326 5.2902 7.4500 1.0383 1.0581 1.0368 1.0613 1.0642 1.0600 1.1001 1.0986 1.1023 1.0996 1.1028 1.0994 1.0990 1.1000 1.0860 1.0901 1.0950 1.0976 1.0646 1.0889
irintensity: 0.8735 0.1171 0.0802 0.6340 1.4131 2.3985 1.9141 0.2499 0.1419 2.2440 0.0832 0.7164 0.8772 6.2682 1.0628 2.9366 16.1242 2.6140 2.1608 8.3983 5.2650 12.8128 0.5243 8.2604 3.6735 1.4440 95.5063 5.6783 28.6689 9.4328 79.8335 6.3145 17.2054 35.5386 16.1441 23.8681 15.3477 53.0889 21.6341 5.0344 8.8407 12.9588 0.1882 6.0042 3.5206 1.4636 6.4457 13.6080 0.7986 62.0885 10.3008 9.0893 72.2987 8.7442 1.7714 4.5576 1.8879 3.4410 11.1781 7.7019 9.7265 7.1298 1.1307 18.8021 4.1247 139.3753 89.4103 39.5447 95.7810 3.6086 74.2842 121.9026 17.2015 85.6776 21.4570 20.3304 50.7014 2.0279 7.0931 17.2426 4.4157 8.7736 15.5917 20.0379 148.5388 46.4818 85.8836 182.4301 19.9382 35.3464 24.5934 2.5610 73.2891 43.9910 29.8109 1.6651 1.5930 9.4411 67.9822 39.7902 49.1959 55.8608 6.7305 9.1487 14.2279 24.8088 351.5077 55.1063
temp: 298.150 k
press: 1.00000 atm
elementType: 8 7 7 7 7 6 6 6 6 6 6 6 6 6 6 6 6 6 1 1 1 1 1 1 1 1 1 1 1 1 1 1 1 1 1 1 1 1
symmnumber: 1
zpe: 834162.6 jmol-1
zpe.correction: 0.317716 hartree
zpe.thermalcorrener: 0.336740 hartree
zpe.thermalcorrenthalpy: 0.337684 hartree
zpe.thermalcorrgfe: 0.268020 hartree
zpe.sumelectzpe: -800.220726 hartree
zpe.sumelectthermal: -800.201702 hartree
zpe.sumelectthermalent: -800.200758 hartree
zpe.sumelectthermalfe: -800.270422 hartree
dipole: 8.0794 -1.8787 -0.7928
dipole: 8.3327
quadrupole: -108.7489 -102.8034 -111.3149
quadrupole: 14.4554 2.5761 0.4364
quadrupole: -1.1265 4.8190 -3.6925 14.4554 2.5761 0.4364
hfenergy: -800.5384417 hartree
pointgroup: C01 [X(C13H20N4O1)]
dipole: 2.9561567 -0.5044677 -1.3244812 debye
polarizability: 283.3567694|-8.9275906|112.3316446|-2.6350459|29.7900636|186.4762094 unknown
InChI: InChI=1S/C13H20N4O/c1-3-9-17(10-4-2)16-15-12-8-6-5-7-11(12)13(14)18/h5-8H,3-4,9-10,14H2,1-2H3
charge 0 multiplicity 1
38 atoms
O  -3.118948 1.141684 2.971604
N  2.096438 0.045955 -0.566393
N  0.784442 0.078453 -0.906878
N  -0.048665 0.231685 0.103763
N  -0.841241 0.899082 2.577286
C  3.039895 -0.115232 -1.691232
C  2.587548 0.159057 0.825715
C  3.63974 -1.539626 -1.799839
C  2.693326 1.6241 1.32048
C  2.583391 -2.627558 -2.081505
C  3.194014 1.688823 2.779088
C  -1.437071 0.20729 -0.272927
C  -2.424209 0.504799 0.725214
C  -1.859534 -0.118135 -1.594941
C  -3.794293 0.468328 0.358374
C  -3.223783 -0.145473 -1.930219
C  -4.20289 0.149107 -0.94915
C  -2.159225 0.873486 2.17704
H  3.851219 0.629889 -1.575197
H  2.477525 0.129037 -2.608428
H  3.58008 -0.326144 0.866304
H  1.901918 -0.411894 1.480117
H  4.390503 -1.519373 -2.614502
H  4.195661 -1.78275 -0.872293
H  3.382835 2.183178 0.658504
H  1.703769 2.109093 1.236188
H  2.051446 -2.429587 -3.030312
H  3.055311 -3.623582 -2.156652
H  1.8266 -2.669488 -1.278238
H  4.196912 1.233727 2.88408
H  3.260721 2.734905 3.12638
H  2.50837 1.15171 3.461493
H  -1.096795 -0.347722 -2.344155
H  -4.517387 0.703145 1.146602
H  -3.526885 -0.399884 -2.95242
H  -5.267718 0.125999 -1.204002
H  -0.122107 0.66463 1.868653
H  -0.641508 1.144685 3.545899
