program: Gaussian 09
title: 000287803
version: EM64L-G09RevD.01
frameworkgroup: C1[X(C22H24N2)]
method: RPBEPBE
basis: SDD
operation: Freq
keyword: #pfreq=noraman
keyword: PBEPBE/SDD
title: #p freq=noraman PBEPBE/SDD
converged: YES YES NO NO
title: Mulliken charges:
elementType: N N C C C C C C C C C C C C C C C C C C C C C C H H H H H H H H H H H H H H H H H H H H H H H H
charge: -0.095721 -0.173220 -0.377202 -0.351965 -0.409427 -0.387930 -0.490231 0.464604 0.466279 -0.372457 -0.382726 -0.577672 -0.460622 0.371185 0.374926 -0.418660 -0.439852 -0.368052 0.448506 -0.426778 -0.408863 -0.813033 -0.244590 -0.243966 0.229520 0.195081 0.184489 0.207020 0.217944 0.208192 0.213194 0.204768 0.223735 0.195137 0.232925 0.215027 0.276674 0.232938 0.234402 0.222239 0.221815 0.240472 0.236430 0.226052 0.221186 0.224657 0.226858 0.226714
chargesum: 0.00000
title: Mulliken charges with hydrogens summed into heavy atoms:
elementType: N N C C C C C C C C C C C C C C C C C C C C C C
charge: -0.095721 -0.173220 0.047399 0.039544 0.016709 0.030032 -0.071359 0.464604 0.466279 -0.139532 -0.167699 -0.300998 -0.227684 0.371185 0.374926 -0.184258 -0.217614 -0.146237 0.448506 -0.186306 -0.172433 -0.141138 -0.017733 -0.017253
polarizability: 3.69654756e+02 -1.81534007e+01 2.54166292e+02 1.78746246e+01 8.66733631e+00 1.62232982e+02
1716.lowfreq: -7.9306 -3.8913 -2.4157 -0.0004 0.0007 0.0008 15.2569 24.3094 26.8915
frequency: 15.0091 24.2729 26.8497 30.6737 48.2268 69.3730 86.4124 117.1815 144.4606 175.6075 182.1613 199.8503 241.2967 261.2221 279.0683 286.3659 314.6106 330.4611 347.3883 392.8157 396.4576 401.2983 410.2315 440.7850 467.5696 480.7651 494.5951 500.9651 514.3697 518.2476 540.7565 602.6671 623.7628 637.9427 643.9508 688.3265 712.8201 722.6001 753.2980 758.4305 781.7191 788.6563 791.5877 807.6530 815.5872 828.3181 849.2974 872.7156 891.7304 919.3769 926.2053 928.9944 944.5679 952.9892 957.7414 960.2525 977.9698 984.5638 990.6818 1001.2358 1009.3710 1010.8421 1021.9698 1045.7104 1055.5010 1063.0665 1094.3428 1121.6044 1130.9478 1134.4594 1149.7424 1160.3940 1167.7967 1171.7305 1178.1952 1201.6545 1207.5336 1226.8882 1230.8351 1236.3972 1243.2705 1252.4393 1270.7883 1289.3194 1302.2527 1315.3189 1329.2449 1343.0770 1353.8278 1357.2964 1366.2295 1373.0031 1379.3831 1394.0802 1398.5232 1409.5353 1421.9286 1424.0435 1433.3109 1450.5254 1457.6107 1461.5095 1465.7929 1469.0460 1470.6578 1474.7432 1476.8735 1515.6218 1515.8781 1571.8366 1581.3936 1606.3472 1632.1341 1641.7581 2842.9028 2854.5266 2865.9765 2901.5124 2913.3065 2969.0284 2983.1679 3030.2025 3044.0945 3047.7386 3055.5793 3076.8141 3086.5270 3111.0909 3111.3825 3116.4014 3117.6281 3123.1940 3130.4402 3137.1362 3140.8879 3147.3204 3158.8695 3160.4875
redmass: 4.7136 3.3957 1.6353 1.8207 4.2131 3.0979 4.1769 4.3893 3.8937 3.8431 3.7325 4.3850 2.3445 2.7852 3.1000 2.3130 4.6312 2.5816 3.6950 2.0521 3.0296 3.4997 2.9077 3.4380 2.9328 2.5719 4.7519 3.6045 6.0828 2.7445 4.5366 2.6174 5.8861 6.7517 3.0691 2.9980 2.8322 4.2415 1.3302 4.3910 2.9791 2.8256 4.1364 1.6702 1.3931 1.3889 1.5491 1.5414 3.5310 3.0507 1.5499 1.6675 1.8689 1.3684 2.2783 1.7433 1.4095 1.4499 1.3473 2.6133 2.5659 1.8557 2.2509 1.5148 1.7832 2.2256 2.2745 1.8008 1.3836 2.2673 3.0473 1.4308 1.3667 1.1267 2.0475 1.1364 1.1384 2.3774 2.3480 1.6079 1.5003 1.4669 1.7825 1.4434 1.4389 1.3368 1.5978 1.4438 1.8757 1.7627 1.6573 1.8047 1.8311 1.5627 1.2399 4.5143 3.4303 3.7665 2.9793 1.1072 1.0924 1.3529 1.2266 1.3972 1.0466 1.1465 1.1044 3.5188 2.8599 5.7544 7.3721 5.5749 6.3808 6.8577 1.0705 1.0713 1.0694 1.0694 1.0710 1.0372 1.0861 1.0893 1.0977 1.0898 1.0895 1.0982 1.0890 1.0883 1.0863 1.0889 1.0857 1.0889 1.0913 1.0969 1.0949 1.0936 1.0935 1.1004
irintensity: 0.0221 0.1120 0.3034 0.2527 0.5218 1.8953 0.3354 1.6138 3.7472 2.8556 1.3105 0.7896 1.2185 4.6086 0.1332 3.6920 0.5162 9.2685 6.1987 1.7303 1.6377 0.1977 0.7394 0.7992 3.8476 25.7119 0.5977 2.8878 0.9496 16.8498 3.1342 2.9453 2.6095 0.1668 1.7218 8.9830 2.3418 1.2377 33.8998 1.6834 12.1180 1.1459 1.5221 62.5640 3.4997 66.0133 2.0456 13.3836 3.8922 26.2161 13.3309 20.1523 6.3817 0.8421 2.0473 6.4439 8.2339 3.0404 0.2365 26.3183 43.1778 8.4156 6.3497 10.2085 4.7515 5.8073 2.4643 3.0059 6.8592 71.2693 17.9271 8.8893 19.5308 8.2791 17.2092 4.0899 4.2598 57.9937 8.7669 76.2905 55.9951 7.8052 10.1248 24.0848 19.9599 2.1943 26.5209 2.9685 19.9524 8.7595 14.3331 17.4013 51.9887 0.0912 7.1067 6.4091 5.1715 1.0886 0.3034 7.3040 9.3146 6.2007 39.1474 13.9377 11.4640 9.2346 9.8954 59.0007 175.2965 11.6415 0.3250 10.6650 87.2490 8.0829 44.2903 50.8719 149.1434 65.7152 118.1098 68.6025 19.7926 49.6759 26.4082 31.9288 24.7417 20.2967 25.7201 20.3774 6.5144 34.0331 4.3693 0.3288 6.0006 21.5546 40.9805 28.6812 12.7304 37.2779
temp: 298.150 k
press: 1.00000 atm
elementType: 7 7 6 6 6 6 6 6 6 6 6 6 6 6 6 6 6 6 6 6 6 6 6 6 1 1 1 1 1 1 1 1 1 1 1 1 1 1 1 1 1 1 1 1 1 1 1 1
symmnumber: 1
zpe: 1058986.9 jmol-1
zpe.correction: 0.403347 hartree
zpe.thermalcorrener: 0.424243 hartree
zpe.thermalcorrenthalpy: 0.425187 hartree
zpe.thermalcorrgfe: 0.350645 hartree
zpe.sumelectzpe: -960.519490 hartree
zpe.sumelectthermal: -960.498594 hartree
zpe.sumelectthermalent: -960.497650 hartree
zpe.sumelectthermalfe: -960.572192 hartree
dipole: -0.7680 -0.9372 0.0282
dipole: 1.2120
quadrupole: -138.8994 -131.2653 -143.4349
quadrupole: -1.7521 6.8368 -0.5470
quadrupole: -1.0329 6.6013 -5.5684 -1.7521 6.8368 -0.5470
hfenergy: -960.922837 hartree
pointgroup: C01 [X(C22H24N2)]
dipole: -0.298976 -0.3709019 -0.0206979 debye
polarizability: 370.0079244|-18.6042053|251.6465925|15.9436037|16.6331538|164.3995134 unknown
InChI: InChI=1S/C22H24N2/c1-18-6-10-22(11-7-18)24-14-12-23(13-15-24)17-19-8-9-20-4-2-3-5-21(20)16-19/h2-11,16H,12-15,17H2,1H3
charge 0 multiplicity 1
48 atoms
N  -0.172891 -1.456071 0.186809
N  2.563134 -0.534182 -0.028021
C  0.280017 -0.68057 -0.991932
C  0.944153 -2.277133 0.708343
C  1.458947 0.238847 -0.629211
C  2.119215 -1.371602 1.110736
C  -1.395924 -2.244619 -0.081932
C  3.872502 0.018768 -0.021036
C  -2.6552 -1.388751 -0.201389
C  4.139583 1.335042 -0.499786
C  4.989807 -0.749658 0.428793
C  -2.802425 -0.205644 0.529902
C  -3.732303 -1.828376 -1.041174
C  -4.005125 0.569933 0.459594
C  -5.092409 0.114213 -0.384791
C  -4.919593 -1.099764 -1.128014
C  5.457908 1.84107 -0.537704
C  6.294306 -0.22503 0.39565
C  6.56492 1.08172 -0.09161
C  -4.171535 1.786079 1.203745
C  -6.297451 0.889562 -0.451861
C  7.981309 1.630121 -0.132752
C  -5.357006 2.52008 1.120339
C  -6.429686 2.068618 0.285202
H  -0.559753 -0.063461 -1.357654
H  0.595126 -1.363522 -1.821781
H  1.301432 -3.019713 -0.050259
H  0.594588 -2.832999 1.598567
H  1.81771 0.718145 -1.556536
H  1.098094 1.039145 0.059366
H  1.794088 -0.726211 1.959731
H  2.952288 -1.998518 1.464301
H  -1.52349 -2.950905 0.764112
H  -1.295157 -2.87512 -1.002777
H  3.321627 1.984041 -0.825512
H  4.845092 -1.776808 0.779624
H  -1.971023 0.126947 1.162576
H  -3.612086 -2.751098 -1.622891
H  -5.734934 -1.446885 -1.774304
H  5.621942 2.859364 -0.912633
H  7.12568 -0.851547 0.744188
H  -3.350259 2.130777 1.843638
H  -7.117049 0.541257 -1.092324
H  8.631818 1.027554 -0.795802
H  7.998317 2.669188 -0.505526
H  8.449313 1.626315 0.870197
H  -5.472808 3.446172 1.694282
H  -7.354104 2.654033 0.228517
