program: Gaussian 09
title: 000289412
version: EM64L-G09RevD.01
frameworkgroup: C1[X(C15H17N3O4S)]
method: RPBEPBE
basis: SDD
operation: Freq
keyword: #p
keyword: freq=noraman
keyword: PBEPBE/SDD
title: #p freq=noraman PBEPBE/SDD
converged: YES YES NO NO
title: Mulliken charges:
elementType: S O O O O N N N C C C C C C C C C C C C C C C H H H H H H H H H H H H H H H H H
charge: 0.741056 -0.640701 -0.622241 -0.288932 -0.244738 -0.191365 -0.249471 -0.700785 -0.096206 0.325222 -0.383392 -0.295040 0.513380 -0.363324 -0.331404 0.242581 -0.175762 -0.411650 -0.346218 -0.328504 0.197950 -0.257573 -0.663634 0.219826 0.254275 0.430510 0.290456 0.347736 0.237780 0.227507 0.284083 0.278516 0.218891 0.307525 0.311901 0.237800 0.223814 0.220680 0.226639 0.252811
chargesum: 0.00000
title: Mulliken charges with hydrogens summed into heavy atoms:
elementType: S O O O O N N N C C C C C C C C C C C C C C C
charge: 0.741056 -0.210191 -0.622241 -0.288932 -0.244738 0.028461 -0.249471 -0.081359 -0.096206 0.325222 -0.129118 -0.004584 0.513380 -0.015588 -0.093624 0.242581 0.051745 -0.192759 -0.062136 -0.049988 0.197950 0.204040 0.036497
polarizability: 3.29077715e+02 -1.94894452e+01 2.49923928e+02 1.94277740e+01 -1.83539442e+01 1.39031584e+02
1716.lowfreq: -3.2565 -0.0015 -0.0013 -0.0011 1.5789 4.6778 9.4105 16.0781 23.9350
frequency: 9.3074 16.0599 23.9150 36.4523 41.6387 59.3222 68.0146 73.4578 83.2226 92.6207 105.4192 129.2631 150.0142 167.6605 197.0507 212.6001 218.0578 242.7607 253.0566 280.1586 292.5550 311.0106 318.3930 325.0236 362.4734 376.7777 387.8769 405.8915 409.9150 421.8083 456.2346 468.8423 484.3722 523.2792 526.0982 560.2056 578.6790 620.2823 648.4080 658.8953 676.4382 682.2878 733.8297 755.6270 790.0401 790.2958 818.4689 825.6439 834.8946 842.7903 852.1788 854.6575 885.5778 889.8470 908.7520 941.0628 970.1363 973.6066 977.6631 996.3971 1008.8214 1018.0317 1034.1325 1062.6345 1065.0842 1095.7973 1098.8323 1127.2016 1149.8206 1156.3072 1172.1161 1193.4718 1249.6708 1276.7212 1279.6618 1316.6078 1319.7578 1334.9962 1357.3093 1372.7403 1388.8537 1390.6831 1393.0552 1414.3291 1448.7190 1456.6140 1463.3807 1471.5587 1483.5461 1484.7473 1492.3324 1568.4977 1574.7456 1608.3814 1622.4762 1624.7638 1643.9839 2753.4585 2953.3262 2993.8283 3030.8757 3065.2722 3089.0160 3095.0255 3120.5904 3120.9158 3125.5430 3140.9237 3144.5612 3162.6519 3168.5340 3181.4547 3568.0214 3708.1394
redmass: 6.0728 4.4827 4.3935 6.1053 4.9545 4.8346 4.8640 8.1509 6.7406 7.4576 4.6667 3.8252 5.4397 5.4202 5.8000 1.4491 3.6153 7.1094 2.7705 6.3228 6.9026 6.5629 3.2423 6.3607 1.1271 1.1685 4.1027 3.8034 2.9391 3.4913 3.6444 5.2794 3.5186 6.2549 4.8769 11.8287 6.0140 6.7312 4.8538 6.7943 4.1170 2.0504 3.2707 3.4061 1.4723 2.9789 1.5550 10.0234 1.8035 2.4843 4.6001 1.9105 1.3261 1.3800 1.1535 1.5996 2.7233 1.7536 1.3725 3.2181 2.6530 1.5405 1.3294 4.9697 2.0649 2.1691 1.3438 1.6070 2.7311 1.6824 1.0820 1.2294 3.4750 1.5114 1.1157 1.2710 1.8690 1.1184 1.2953 1.7804 3.8918 1.2380 6.0952 3.2486 3.0372 1.1016 1.0447 3.3082 3.2222 1.0572 2.4697 6.9837 6.5495 6.1467 9.3607 4.1376 1.2948 1.0754 1.0697 1.0362 1.0595 1.0994 1.0974 1.1034 1.1060 1.0876 1.0895 1.0918 1.0913 1.0977 1.0933 1.0946 1.0450 1.1041
irintensity: 2.1428 0.8116 1.0327 1.0176 0.5542 2.3319 1.5444 5.6551 1.7552 0.8514 1.6754 1.7051 0.6165 20.6071 11.2161 10.0428 6.3731 0.4599 4.6582 19.1237 5.4993 15.8832 12.2421 25.2836 152.5519 166.4735 26.3448 1.8346 1.8232 3.0990 13.7702 3.9260 3.2605 0.3144 4.5339 56.2858 14.7945 11.5794 2.4382 4.3852 19.5669 31.1963 18.5696 24.1163 38.4457 24.3489 1.1284 45.5037 22.6077 26.8237 7.4376 35.2590 114.7904 1.6390 175.8847 12.1296 6.4456 8.4368 2.2844 3.9707 42.6954 1.3995 1.2147 289.8418 2.8038 18.6588 30.1603 0.8110 19.4139 47.7059 1.8053 70.9926 350.0694 17.6751 2.6286 8.5956 32.0826 39.7428 6.2073 41.1066 73.9083 22.3784 23.4455 24.9779 1.6523 17.6658 14.7033 28.9474 97.4036 15.2995 6.2512 11.4444 27.3541 14.1476 151.7481 77.3663 260.0533 2785.4268 18.0856 21.1792 33.6814 284.3967 36.9768 0.6827 29.1886 15.7774 3.6574 8.1388 10.8312 21.8310 0.3613 1.0773 71.3062 21.3722
temp: 298.150 k
press: 1.00000 atm
elementType: 16 8 8 8 8 7 7 7 6 6 6 6 6 6 6 6 6 6 6 6 6 6 6 1 1 1 1 1 1 1 1 1 1 1 1 1 1 1 1 1
symmnumber: 1
zpe: 784988.3 jmol-1
zpe.correction: 0.298986 hartree
zpe.thermalcorrener: 0.323201 hartree
zpe.thermalcorrenthalpy: 0.324145 hartree
zpe.thermalcorrgfe: 0.240466 hartree
zpe.sumelectzpe: -1443.191340 hartree
zpe.sumelectthermal: -1443.167125 hartree
zpe.sumelectthermalent: -1443.166181 hartree
zpe.sumelectthermalfe: -1443.249860 hartree
dipole: 1.3948 2.0510 -2.9383
dipole: 3.8452
quadrupole: -74.2488 -136.6870 -143.4779
quadrupole: 10.0166 8.3278 1.6101
quadrupole: 43.8891 -18.5491 -25.3400 10.0166 8.3278 1.6101
hfenergy: -1443.4903262 hartree
pointgroup: C01 [X(C15H17N3O4S1)]
dipole: -0.689194 -0.9894676 0.9135761 debye
polarizability: 294.1125198|-81.4483863|178.5914438|-9.6318154|-10.8497298|245.3292639 unknown
InChI: InChI=1S/C9H10N2O2.C6H7NO2S/c1-2-13-9(12)7-3-5-8(11-10)6-4-7;7-5-2-1-3-6(4-5)10(8)9/h3-6,10H,2H2,1H3;1-4,8H,7H2
charge 0 multiplicity 1
40 atoms
S  3.000488 -0.06017 -0.095785
O  2.186503 -1.468036 0.777581
O  1.845584 0.871609 -0.830714
O  -5.70441 0.936848 1.217133
O  -4.735546 1.708076 -0.763433
N  0.755231 -0.379778 3.830866
N  0.457495 -0.389443 2.577894
N  5.702796 -4.210877 -1.966864
C  3.637622 -1.161952 -1.491151
C  -0.845092 0.002238 2.074551
C  4.422887 -2.279553 -1.172896
C  3.320268 -0.773536 -2.802962
C  4.931448 -3.08044 -2.236759
C  -0.890599 0.539306 0.76167
C  -2.031598 -0.184644 2.837569
C  -3.324511 0.771575 0.994341
C  3.834429 -1.573588 -3.850986
C  4.630143 -2.704319 -3.580721
C  -2.135429 0.939214 0.23866
C  -3.26896 0.197519 2.293303
C  -4.61963 1.19279 0.375517
C  -7.05226 1.333034 0.701004
C  -7.339288 2.805948 1.004388
H  -0.044213 -0.003243 4.433927
H  4.603721 -2.557672 -0.128753
H  1.596067 -1.052876 1.526401
H  2.679432 0.096462 -2.978062
H  0.033308 0.663222 0.177121
H  -1.996715 -0.665279 3.823235
H  3.610001 -1.311404 -4.890906
H  -2.204239 1.37419 -0.763172
H  -4.198022 0.044584 2.848048
H  5.01855 -3.309352 -4.409274
H  6.045839 -4.798651 -2.720535
H  5.892499 -4.495691 -1.010682
H  -7.082063 1.132972 -0.384359
H  -7.739783 0.656766 1.233543
H  -8.371656 3.053041 0.694536
H  -7.244844 3.01311 2.084304
H  -6.648254 3.462797 0.450518
