program: Gaussian 09
title: 000285523
version: EM64L-G09RevD.01
frameworkgroup: C1[X(C12H14ClNO)]
method: RPBEPBE
basis: SDD
operation: Freq
keyword: #p
keyword: freq=noraman
keyword: PBEPBE/SDD
title: #p freq=noraman PBEPBE/SDD
converged: YES YES NO NO
title: Mulliken charges:
elementType: Cl O N C C C C C C C C C C C C H H H H H H H H H H H H H H
charge: -0.073108 -0.266204 -0.396710 -0.231439 -0.116137 -0.589192 0.433694 -0.409279 -0.441645 0.249155 -0.492802 -0.231206 -0.224359 -0.239496 -0.562569 0.261417 0.282488 0.239641 0.239255 0.304401 0.293725 0.236110 0.230618 0.262113 0.226732 0.223421 0.226682 0.297903 0.266793
chargesum: 0.00000
title: Mulliken charges with hydrogens summed into heavy atoms:
elementType: Cl O N C C C C C C C C C C C C
charge: -0.073108 -0.266204 -0.092309 0.029978 0.166351 -0.110296 0.433694 -0.115554 -0.205535 0.249155 -0.000071 -0.004474 -0.000939 -0.012814 0.002127
polarizability: 2.00636122e+02 -5.76905574e+00 1.43700622e+02 -3.20200002e+00 -9.72008219e+00 8.25057323e+01
1716.lowfreq: -10.3666 -5.9614 -5.5385 0.0003 0.0018 0.0021 21.0460 36.0069 37.1279
frequency: 20.8475 35.9767 37.1188 43.7909 61.7741 86.6173 125.9740 150.1293 189.2425 237.9822 287.4422 321.9467 354.4670 399.2677 406.1421 475.0990 480.5062 546.9805 568.9602 614.1058 616.8190 635.3239 708.9491 728.0811 747.9575 778.7688 787.0092 828.4349 863.6988 892.7885 903.4970 930.7585 959.8042 985.5797 988.3297 988.9743 998.9690 1006.6019 1027.9318 1058.7714 1071.6463 1072.7229 1085.1325 1093.7423 1117.2172 1151.4906 1171.4004 1187.8410 1195.4393 1231.7590 1244.8048 1251.9344 1284.5074 1313.1096 1319.5356 1334.1061 1375.6344 1398.6607 1434.5446 1449.1659 1459.6017 1460.7944 1467.2571 1490.2083 1587.6778 1607.7985 1615.6839 2998.2256 3057.3678 3075.2219 3094.7604 3101.4134 3111.5240 3117.3355 3123.0224 3133.6621 3144.2462 3160.3789 3163.7359 3200.5686 3533.1128
redmass: 6.1189 2.6366 5.5322 4.5999 3.9727 4.2719 4.0147 4.9414 4.2047 8.8426 4.7690 4.4227 3.9752 3.3506 2.8809 2.8374 3.1018 1.3063 3.2050 3.9091 4.0882 6.5984 2.0255 3.0487 2.6268 1.7944 1.3888 1.8177 1.2691 3.9553 3.1649 1.3668 2.2213 1.4683 2.0780 2.4882 3.4691 1.4453 2.0787 2.1788 1.1740 1.5035 1.4758 1.7754 1.2078 2.1440 1.0553 1.1218 2.0446 1.5377 1.4599 1.3255 1.2318 1.4638 1.3354 1.5366 7.3464 1.7893 2.2037 1.0907 1.5251 1.1034 1.8545 2.5895 6.1401 6.6532 6.0247 1.0597 1.1011 1.0582 1.0659 1.0791 1.0894 1.0849 1.0880 1.0926 1.0966 1.1016 1.1108 1.1154 1.0777
irintensity: 0.2956 0.1341 0.7345 0.7608 8.4571 2.0576 4.4318 7.6720 5.5671 1.4299 1.1900 6.5591 3.4706 1.4972 0.0157 4.0681 6.7970 103.9977 4.6232 3.8818 0.7813 52.4740 45.7049 16.6208 16.0356 38.6861 10.7807 3.8925 1.0624 10.1913 4.4864 3.5672 6.0822 0.1972 0.3667 0.4135 3.0061 1.2933 12.1892 9.8800 8.9695 9.9018 7.5354 4.2545 1.8887 0.6829 0.0195 1.4541 37.7507 3.9074 20.3472 18.0624 1.1915 11.5151 3.0341 56.7118 0.3479 2.1566 5.3263 11.3726 90.1204 19.7556 167.9283 24.7711 1.5127 129.4983 17.8005 9.7527 10.8347 11.5016 6.3930 10.8001 15.4642 3.3383 5.2421 11.0702 30.2569 33.5870 7.9206 14.5495 19.5429
temp: 298.150 k
press: 1.00000 atm
elementType: 17 8 7 6 6 6 6 6 6 6 6 6 6 6 6 1 1 1 1 1 1 1 1 1 1 1 1 1 1
symmnumber: 1
zpe: 612305.0 jmol-1
zpe.correction: 0.233215 hartree
zpe.thermalcorrener: 0.248003 hartree
zpe.thermalcorrenthalpy: 0.248947 hartree
zpe.thermalcorrgfe: 0.187632 hartree
zpe.sumelectzpe: -1054.590373 hartree
zpe.sumelectthermal: -1054.575585 hartree
zpe.sumelectthermalent: -1054.574641 hartree
zpe.sumelectthermalfe: -1054.635955 hartree
dipole: 1.5019 3.7822 -0.0072
dipole: 4.0695
quadrupole: -106.8510 -87.3661 -96.9236
quadrupole: -5.4597 -0.9566 -0.4005
quadrupole: -9.8041 9.6808 0.1233 -5.4597 -0.9566 -0.4005
hfenergy: -1054.8235877 hartree
pointgroup: C01 [X(C12H14Cl1N1O1)]
dipole: -0.5194961 -1.5131984 -0.061174 debye
polarizability: 201.0643043|-2.4774062|142.0373175|-2.6382545|13.1864911|83.7408545 unknown
InChI: InChI=1S/C12H14ClNO/c13-7-6-12(15)14-11-8-10(11)9-4-2-1-3-5-9/h1-5,10-11,14H,6-8H2
charge 0 multiplicity 1
29 atoms
Cl 6.231024 1.000882 -0.598353
O  1.68154 1.003842 0.504604
N  1.627122 -1.316373 0.316511
C  -0.775314 -1.006121 -0.572569
C  0.20006 -1.410278 0.544798
C  -0.610685 -2.484699 -0.188547
C  -2.009728 -0.211621 -0.242084
C  -1.867144 1.114909 0.245049
C  -3.309323 -0.73845 -0.443967
C  2.289104 -0.09965 0.345507
C  3.817381 -0.181177 0.195134
C  -3.009026 1.898402 0.520199
C  -4.452743 0.04598 -0.166068
C  -4.305193 1.367294 0.315001
C  4.342351 1.049238 -0.550321
H  -0.276556 -0.71542 -1.506202
H  -0.117044 -1.156864 1.563347
H  -1.4107 -2.971635 0.376768
H  -0.087984 -3.137259 -0.895663
H  2.170712 -2.177037 0.223865
H  -0.85687 1.510569 0.407142
H  -3.423072 -1.761255 -0.82347
H  4.127221 -1.107102 -0.323697
H  4.26596 -0.206881 1.206878
H  -2.89019 2.921001 0.896329
H  -5.454071 -0.370119 -0.326352
H  -5.190596 1.976523 0.52999
H  4.067804 1.98065 -0.038602
H  4.020854 1.079953 -1.601226
