program: Gaussian 09
title: 000284279
version: EM64L-G09RevD.01
frameworkgroup: C1[X(C6H3F2NO4S)]
method: RPBEPBE
basis: SDD
operation: Freq
keyword: #p
keyword: freq=noraman
keyword: PBEPBE/SDD
title: #p freq=noraman PBEPBE/SDD
converged: YES YES NO NO
title: Mulliken charges:
elementType: S F F O O O O N C C C C C C H H H
charge: 1.104834 -0.331936 -0.130242 -0.462835 -0.456144 -0.179357 -0.154344 0.030513 -0.105394 -0.298290 0.270982 -0.177602 0.252257 -0.296902 0.342790 0.301196 0.290476
chargesum: 0.00000
title: Mulliken charges with hydrogens summed into heavy atoms:
elementType: S F F O O O O N C C C C C C
charge: 1.104834 -0.331936 -0.130242 -0.462835 -0.456144 -0.179357 -0.154344 0.030513 -0.105394 0.044499 0.270982 0.123594 0.252257 -0.006426
polarizability: 1.57955673e+02 -1.24287744e+00 1.25498005e+02 2.97085256e+00 -1.14540878e-01 5.65139740e+01
1716.lowfreq: -7.3528 -2.7920 -0.0006 0.0004 0.0016 2.3678 10.1853 22.2547 76.0296
frequency: 10.0336 22.1268 76.0276 104.9143 129.6951 174.8120 197.0901 223.6902 241.5305 291.8535 302.8749 357.5779 368.2388 391.6369 422.4943 431.1108 523.7289 534.1591 564.5428 611.2463 657.2792 669.8030 732.2579 757.1500 825.1820 836.4778 859.8689 935.0368 970.2690 1000.9291 1056.9994 1064.8141 1141.1248 1191.9798 1212.5886 1240.5963 1367.9628 1393.4318 1409.1778 1456.9876 1585.0035 1598.2997 3163.0368 3168.1849 3189.0804
redmass: 15.7593 13.6491 13.3346 12.5610 6.1545 10.7635 14.1442 13.1060 13.7113 13.1973 17.2495 8.8182 11.3374 9.2138 17.5897 3.7733 5.0361 6.9306 9.9076 9.0952 8.5401 7.0751 5.0056 8.7192 8.4563 1.4373 16.1088 1.3785 1.3497 17.1289 1.9160 7.1816 1.3731 10.7513 3.1651 1.4737 5.2735 9.5424 5.9524 2.8591 8.4838 7.7614 1.0926 1.0908 1.0972
irintensity: 0.1381 0.8283 4.2668 5.1890 0.5056 3.6640 0.3781 5.2638 4.7260 2.3034 1.3679 1.9089 1.3433 5.6728 94.7488 0.9424 15.0627 9.5239 127.9822 12.6891 7.0225 3.6937 2.8086 16.0110 17.0904 48.5431 98.4486 16.7751 2.9757 68.5268 56.2196 4.0678 22.4807 202.4600 38.8598 27.9795 23.0571 18.2277 38.5781 108.6986 31.3978 38.9216 25.4944 4.6604 2.6720
temp: 298.150 k
press: 1.00000 atm
elementType: 16 9 9 8 8 8 8 7 6 6 6 6 6 6 1 1 1
symmnumber: 1
zpe: 236040.6 jmol-1
zpe.correction: 0.089903 hartree
zpe.thermalcorrener: 0.103036 hartree
zpe.thermalcorrenthalpy: 0.103980 hartree
zpe.thermalcorrgfe: 0.047037 hartree
zpe.sumelectzpe: -1182.531504 hartree
zpe.sumelectthermal: -1182.518371 hartree
zpe.sumelectthermalent: -1182.517427 hartree
zpe.sumelectthermalfe: -1182.574370 hartree
dipole: 1.0297 4.4674 -0.5540
dipole: 4.6179
quadrupole: -115.4735 -84.9366 -88.3491
quadrupole: 2.8043 0.8736 0.3445
quadrupole: -19.2204 11.3165 7.9039 2.8043 0.8736 0.3445
hfenergy: -1182.621407 hartree
pointgroup: C01 [X(C6H3F2N1O4S1)]
dipole: -0.3685989 1.7696686 0.1824682 debye
dipolederiv: 1.9840054 -0.1927474 -0.0016101 -0.2947089 1.2194724 -0.0006446 -0.0214816 0.0076786 1.6112072 -0.5238763 0.0494831 0.0524712 0.0711306 -0.3228894 -0.005781 0.2435948 -0.0555049 -0.8636058 -0.8205754 0.3482016 -0.0556147 0.3198936 -0.3371808 0.0223438 -0.0524309 0.0271426 -0.1032474 -0.676317 0.0089495 -0.041444 -0.0316849 -0.4921465 -0.0651655 -0.0645937 -0.0180227 -0.4216073 -0.5988894 0.0304105 0.0042128 0.1209853 -0.5245863 0.0706194 -0.041638 0.0396968 -0.4120685 -0.506887 -0.0408627 0.0259124 -0.0172468 -0.7401617 -0.0538978 0.0248186 -0.0276614 -0.208846 -0.7671008 0.0543368 0.0486527 -0.087407 -0.4157161 -0.0268015 0.0382795 -0.0371231 -0.1938955 1.3731958 0.2690893 -0.0955202 0.4038578 1.2910608 0.0951565 -0.0738713 0.070726 0.2101993 -0.0784844 -0.0934474 0.0000799 -0.0914819 -0.2627185 0.0010801 -0.1535167 0.0372453 -0.1623152 0.0819297 0.1235858 0.0109236 0.1794001 -0.126776 0.0134278 0.0049365 -0.0153743 -0.0204 -0.4020843 -0.1870208 0.0067425 -0.1851875 -0.3625892 -0.0037263 -0.0005574 -0.0023185 0.0554319 -0.0549838 0.0696211 -0.0003872 -0.1852753 0.143772 -0.0204923 0.0374949 -0.005722 -0.0445686 1.0360034 -0.44964 0.0734855 -0.1315948 0.5531498 -0.0272986 0.0712623 -0.0245976 0.1613205 -0.409839 0.0175912 -0.0105743 -0.0994729 0.0420008 -0.0112899 -0.0044935 -0.0088127 -0.1228577 0.1991626 0.0143403 -0.0058318 0.0304799 0.1608553 0.0047209 0.0104392 0.0106078 0.1702392 0.104519 -0.0474021 -0.0043489 -0.0167803 0.1343558 0.0021484 -0.0049316 -0.0062802 0.160431 0.0602215 0.0255112 -0.0071494 0.0150929 0.0400976 0.0056007 -0.0133113 0.0083202 0.184583 unknown
polarizability: 157.9721549|0.6193196|125.4361737|3.3089341|-1.2812251|56.559323 unknown
InChI: InChI=1S/C6H3F2NO4S/c7-5-2-1-4(14(8,12)13)3-6(5)9(10)11/h1-3H
charge 0 multiplicity 1
17 atoms
S  2.796921 -0.350592 0.178733
F  3.102412 -0.424862 -1.646384
F  -2.833837 1.743948 -0.135674
O  3.755235 0.805935 0.745148
O  2.825452 -1.862523 0.712513
O  -2.066358 -2.430969 -0.088603
O  -3.629062 -0.782873 0.142225
N  -2.419195 -1.19513 0.01876
C  1.035212 0.276972 0.076062
C  0.00225 -0.663415 0.066274
C  -1.323988 -0.182294 0.010444
C  0.836568 1.669106 0.021752
C  -1.557145 1.216583 -0.052789
C  -0.488279 2.136243 -0.043914
H  0.179054 -1.743416 0.107282
H  1.683878 2.361117 0.039321
H  -0.713319 3.20487 -0.094352
