program: Gaussian 09
title: 000284633
version: EM64L-G09RevD.01
frameworkgroup: C1[X(C14H22N4)]
method: RPBEPBE
basis: SDD
operation: Freq
keyword: #pfreq=noraman
keyword: PBEPBE/SDD
title: #p freq=noraman PBEPBE/SDD
converged: NO YES NO NO
title: Mulliken charges:
elementType: N N N N C C C C C C C C C C C C C C H H H H H H H H H H H H H H H H H H H H H H
charge: -0.352639 -0.018879 -0.165908 -0.116277 0.412068 -0.089649 -0.096722 -0.087530 -0.536079 -0.550151 -0.511386 -0.456942 -0.452744 -0.459287 0.231759 -0.419784 -0.365478 -0.693486 0.205780 0.210039 0.207133 0.223954 0.229630 0.241393 0.228811 0.200935 0.227804 0.202056 0.201577 0.193198 0.204672 0.202153 0.202660 0.236890 0.214404 0.236902 0.194232 0.193939 0.252435 0.218514
chargesum: 0.00000
title: Mulliken charges with hydrogens summed into heavy atoms:
elementType: N N N N C C C C C C C C C C C C C C
charge: -0.352639 -0.018879 -0.165908 -0.116277 0.412068 0.116131 0.113316 0.119603 -0.082495 -0.079947 -0.082647 -0.053309 -0.054873 -0.054474 0.231759 0.031510 0.065656 -0.028597
polarizability: 1.94376814e+02 -9.85873377e-01 1.60356602e+02 1.55449955e+00 4.09515177e+00 1.33982686e+02
1716.lowfreq: -34.7958 -10.9654 -3.4960 -0.0005 -0.0003 -0.0001 17.3067 47.6442 98.6648
frequency: -9.2042 46.2591 98.6277 104.0528 113.7479 175.4887 216.7429 231.8607 269.9340 278.6005 286.2119 292.6999 331.8569 378.4956 388.1196 399.0343 402.3380 416.6141 439.7736 451.6862 519.5988 633.4232 636.7651 646.2749 671.9162 677.9164 688.3542 760.4898 797.9489 802.6157 810.7265 832.4730 867.0252 869.4239 874.0689 874.9050 895.8055 915.4463 933.7692 941.0822 958.6661 972.4456 975.6665 987.4671 1011.7611 1020.4187 1045.8330 1047.5504 1051.4241 1059.5612 1082.7210 1093.5353 1103.9402 1105.4913 1106.4290 1111.3198 1116.6204 1153.3627 1170.8152 1189.3428 1192.1854 1228.4596 1259.9038 1268.7228 1271.2882 1285.6812 1287.8565 1290.1745 1299.0396 1306.6653 1313.7486 1320.9526 1327.0321 1342.7847 1344.1787 1347.4602 1350.9895 1356.0254 1362.1781 1366.6068 1391.5836 1448.7545 1449.6900 1452.7987 1459.6535 1462.7300 1463.9138 1467.2306 1470.3683 1475.7967 1484.6190 1489.4503 2968.0113 2970.8743 2971.7729 2975.4732 2977.0468 2981.5260 2986.5546 2998.7821 2999.7037 3002.8424 3007.4762 3017.7584 3026.1364 3028.2589 3033.2314 3035.6301 3043.5395 3054.1872 3056.7648 3069.7792 3076.9317 3091.4850
redmass: 3.5865 3.1769 3.7924 4.6888 2.4207 1.8892 2.1275 3.8280 1.8253 5.1004 2.2819 2.2784 2.3032 2.6660 3.5895 3.5866 3.2789 1.7642 2.0372 1.6827 4.4691 3.8704 3.8501 3.1470 10.2517 4.4516 4.2379 4.1799 1.4700 2.7793 2.7065 3.5269 2.2269 1.5880 1.6369 1.5835 1.7422 3.3362 5.0309 2.0789 2.6220 2.2059 2.1949 3.0079 7.6595 6.0851 1.8433 1.8914 1.7310 1.6218 2.0318 2.2800 1.3404 1.5527 1.3106 1.0686 1.0367 5.0735 4.8686 1.1842 1.2222 1.3098 1.5226 1.6806 1.8023 1.8584 1.8001 1.8241 2.0559 1.9169 1.5536 1.6214 1.3201 1.4908 1.4455 1.4069 1.5095 1.6718 1.6148 1.5544 1.2342 1.5184 1.2676 1.2041 1.1628 1.0899 1.0902 1.0998 1.4945 1.0542 1.0918 1.0522 1.0625 1.0616 1.0617 1.0615 1.0380 1.0612 1.0637 1.0633 1.0736 1.0819 1.0772 1.0786 1.1022 1.1031 1.0978 1.1020 1.1026 1.1012 1.0972 1.1020 1.0987 1.1005
irintensity: 0.7084 0.9426 0.2858 2.7772 0.9295 1.7756 0.0257 0.6494 1.0521 4.1109 0.0109 0.0817 0.7929 0.6558 0.0313 0.1116 0.4121 0.0954 0.1816 1.2228 1.7254 0.1974 0.0704 3.3713 0.7187 2.4885 0.6295 1.7668 10.3530 3.6431 3.6811 2.7993 3.7266 0.0751 0.6199 0.3235 12.2646 1.8544 10.3067 1.5311 12.6733 0.2791 1.5389 5.5468 14.6963 13.3561 0.3936 0.8122 0.0110 6.4590 4.9641 1.7260 4.5541 4.8074 3.4248 0.4232 0.1040 2.2118 0.3184 2.1129 0.6500 4.6256 2.5528 0.3323 0.5642 2.9893 1.4633 0.1573 34.7642 14.1690 1.4123 4.7894 0.1976 8.3966 2.0121 2.5994 27.1533 8.6067 2.9319 0.3734 17.1051 5.9665 0.9645 0.8096 2.4404 16.6002 13.6292 17.6306 27.0883 9.0704 0.1160 15.0267 24.9377 29.1978 26.0943 37.6824 26.7490 13.5724 19.9325 39.1190 57.4360 131.7134 92.1278 21.8218 8.6450 10.9368 29.6100 91.8889 15.6633 30.8339 16.7741 24.2103 51.6093 42.9311
temp: 298.150 k
press: 1.00000 atm
elementType: 7 7 7 7 6 6 6 6 6 6 6 6 6 6 6 6 6 6 1 1 1 1 1 1 1 1 1 1 1 1 1 1 1 1 1 1 1 1 1 1
symmnumber: 1
zpe: 911248.4 jmol-1
zpe.correction: 0.347076 hartree
zpe.thermalcorrener: 0.361526 hartree
zpe.thermalcorrenthalpy: 0.362470 hartree
zpe.thermalcorrgfe: 0.306601 hartree
zpe.sumelectzpe: -764.283994 hartree
zpe.sumelectthermal: -764.269544 hartree
zpe.sumelectthermalent: -764.268600 hartree
zpe.sumelectthermalfe: -764.324469 hartree
dipole: 4.5892 -5.3749 -0.7158
dipole: 7.1037
quadrupole: -116.3334 -120.3010 -106.0620
quadrupole: 13.9503 1.2580 -0.3446
quadrupole: -2.1013 -6.0689 8.1702 13.9503 1.2580 -0.3446
hfenergy: -764.6310697 hartree
pointgroup: C01 [X(C14H22N4)]
dipole: 2.038207 -1.7978579 -0.6514647 debye
polarizability: 194.1218362|3.3570873|158.5429297|-0.3013048|8.2591655|136.0513369 unknown
InChI: InChI=1S/C14H22N4/c1-2-3-13-15-16-17-18(13)14-7-10-4-11(8-14)6-12(5-10)9-14/h10-12H,2-9H2,1H3
charge 0 multiplicity 1
40 atoms
N  -0.916487 0.721191 0.148231
N  -1.274836 1.985832 0.672654
N  -3.139382 0.841412 0.104649
N  -2.616145 2.035133 0.633904
C  0.533888 0.331003 0.088644
C  2.400008 -0.557352 -1.388792
C  2.911795 1.17034 0.384449
C  2.317431 -1.19271 1.067537
C  0.898733 -0.158562 -1.343227
C  1.411982 1.566051 0.437061
C  0.816301 -0.795581 1.127449
C  3.275216 0.674538 -1.040468
C  2.663966 -1.692843 -0.361718
C  3.191352 0.041836 1.413287
C  -2.073059 0.042394 -0.187267
C  -2.213828 -1.322595 -0.812725
C  -3.617964 -1.94315 -0.600883
C  -3.906855 -2.3196 0.867411
H  2.641323 -0.913578 -2.409202
H  3.517844 2.062009 0.635789
H  2.501126 -2.001189 1.801586
H  0.691539 0.651787 -2.068781
H  0.281924 -1.029916 -1.628759
H  1.145752 1.941885 1.440448
H  1.200027 2.385475 -0.274213
H  0.186586 -1.682125 0.920328
H  0.551265 -0.430628 2.138228
H  4.348455 0.403949 -1.087955
H  3.106751 1.482664 -1.77981
H  2.054827 -2.584735 -0.61308
H  3.726879 -2.001346 -0.406083
H  4.263832 -0.23517 1.392789
H  2.962393 0.395174 2.438232
H  -2.017895 -1.233269 -1.900411
H  -1.445165 -2.008505 -0.409958
H  -4.381967 -1.227754 -0.953487
H  -3.68784 -2.845612 -1.239426
H  -3.152514 -3.029555 1.25846
H  -3.907487 -1.420941 1.508389
H  -4.898766 -2.797561 0.959925
