program: Gaussian 09
title: 000283828
version: EM64L-G09RevD.01
frameworkgroup: C1[X(C16H11ClF3NO2)]
method: RPBEPBE
basis: SDD
operation: Freq
keyword: #p
keyword: freq=noraman
keyword: PBEPBE/SDD
title: #p freq=noraman PBEPBE/SDD
converged: YES YES NO NO
title: Mulliken charges:
elementType: Cl F F F O O N C C C C C C C C C C C C C C C C H H H H H H H H H H H
charge: -0.045830 -0.166469 -0.167559 -0.169721 -0.398017 -0.246064 -0.701408 0.150828 0.353932 0.167961 0.343915 -0.336469 -0.563750 -0.396148 -0.359563 0.462772 0.241370 0.045509 -0.355010 -0.388284 -0.223095 -0.227253 -0.113559 0.255443 0.252605 0.261192 0.241215 0.368714 0.308741 0.260953 0.239807 0.256099 0.259845 0.387298
chargesum: 0.00000
title: Mulliken charges with hydrogens summed into heavy atoms:
elementType: Cl F F F O O N C C C C C C C C C C C C C C C C
charge: -0.045830 -0.166469 -0.167559 -0.169721 -0.010720 -0.246064 -0.023953 0.150828 0.353932 0.167961 0.343915 -0.081026 -0.311145 -0.134956 -0.118348 0.462772 0.241370 0.045509 -0.094056 -0.148477 0.033003 0.032592 -0.113559
polarizability: 3.78628443e+02 1.13244843e+01 1.74864402e+02 -6.09541927e+00 -5.16142947e+00 1.34891080e+02
1716.lowfreq: -12.8116 -4.9480 -2.3662 0.0012 0.0019 0.0025 10.8639 15.8009 20.6101
frequency: 10.1745 15.7423 20.5417 25.2067 47.1518 59.7093 96.4226 100.7929 130.9700 147.2245 166.6659 187.6474 197.1512 239.5764 267.2152 283.8015 296.6130 325.3895 339.0554 358.5826 382.0311 408.4481 410.3187 442.5012 456.6633 471.8228 488.4699 501.0665 516.9658 535.7361 540.2117 586.0036 619.4436 625.0215 635.7950 646.0665 658.9636 675.2584 685.9394 706.9896 715.4479 736.3774 769.2559 803.8521 821.1118 826.8583 833.0306 876.9629 889.9183 915.5953 938.2078 949.4175 962.2408 970.7746 982.2195 999.6482 1018.4093 1028.2820 1064.9154 1078.7631 1097.0538 1116.5045 1152.5532 1196.2850 1199.1785 1241.4496 1253.3268 1278.1998 1282.2188 1303.3681 1321.7413 1349.4725 1388.9758 1394.5785 1407.9908 1453.1010 1478.8353 1498.8928 1569.6255 1572.1559 1589.9223 1597.9352 1628.0463 1632.7124 1672.5184 3096.4696 3132.8682 3147.0664 3148.2119 3162.7881 3173.1310 3177.2417 3189.0160 3443.7869 3476.9955 3645.2812
redmass: 15.5661 10.2732 4.2744 6.3524 9.2156 8.1896 9.1620 8.7638 8.8600 9.4093 6.1326 7.1466 7.2092 7.1457 6.4410 6.5315 6.7359 7.7564 8.5718 5.3062 4.8549 7.1663 2.9575 2.1132 1.7097 5.2960 5.3800 3.5787 3.4485 4.9552 5.2220 3.5390 2.8172 5.3543 1.4584 3.2216 5.5108 2.9548 5.1680 5.2226 3.5116 3.8804 5.2025 2.1239 2.3156 1.3212 1.4619 1.5717 5.9113 1.4724 4.9439 1.4105 1.4175 1.3814 11.6738 4.0342 5.4830 3.1212 2.8023 2.6119 1.8550 1.4287 1.3806 1.1363 2.1708 3.2786 2.3836 1.9528 1.6236 1.3408 2.2079 3.4151 3.0405 6.8453 2.4439 5.2760 2.3485 3.0808 7.1456 6.9027 6.6793 5.9996 6.2861 6.9172 1.2366 1.0880 1.0899 1.0898 1.0908 1.0899 1.0956 1.0964 1.0948 1.0556 1.0635 1.0956
irintensity: 0.0206 0.6317 0.1451 0.3926 0.7027 0.3559 0.1945 0.8132 1.2419 0.6255 0.5348 0.9010 2.9259 1.6968 1.2027 5.4854 6.9784 14.9370 1.8564 1.1424 1.5925 5.2820 0.3144 23.9333 55.7961 15.5248 3.8274 21.4903 36.8734 2.8167 8.8370 44.6943 6.5900 11.2466 126.2519 113.6316 1.3630 72.5749 9.4734 5.9777 1.4903 7.5873 24.5677 31.0336 16.0806 14.7022 42.8204 56.1561 108.9402 16.1110 63.7269 4.8157 1.5674 0.7683 215.2346 41.0718 109.1049 167.7675 203.7347 70.8633 36.9866 10.3531 18.4177 1.5874 9.4205 126.9219 242.2516 20.5179 0.4212 2.4079 70.7549 19.3358 11.3256 49.3180 2.6266 131.1251 109.9020 21.7113 5.3488 23.8168 134.6718 37.5633 7.4347 237.2481 76.0483 14.8387 8.0814 6.4830 0.8425 1.4904 3.8513 0.9044 3.4032 172.4013 27.6448 66.0226
temp: 298.150 k
press: 1.00000 atm
elementType: 17 9 9 9 8 8 7 6 6 6 6 6 6 6 6 6 6 6 6 6 6 6 6 1 1 1 1 1 1 1 1 1 1 1
symmnumber: 1
zpe: 615838.4 jmol-1
zpe.correction: 0.234560 hartree
zpe.thermalcorrener: 0.255527 hartree
zpe.thermalcorrenthalpy: 0.256471 hartree
zpe.thermalcorrgfe: 0.179914 hartree
zpe.sumelectzpe: -1579.475287 hartree
zpe.sumelectthermal: -1579.454321 hartree
zpe.sumelectthermalent: -1579.453376 hartree
zpe.sumelectthermalfe: -1579.529934 hartree
dipole: -3.0988 2.0662 -0.0401
dipole: 3.7247
quadrupole: -177.0013 -127.2259 -134.6553
quadrupole: 6.7448 -6.4671 3.3440
quadrupole: -30.7071 19.0683 11.6389 6.7448 -6.4671 3.3440
hfenergy: -1579.7098479 hartree
pointgroup: C01 [X(C16H11Cl1F3N1O2)]
dipole: 1.2266054 -0.0487055 0.8003027 debye
polarizability: 377.6927135|15.5583751|136.9976858|-11.6568552|-9.2534891|173.6935258 unknown
InChI: InChI=1S/C16H11ClF3NO2/c17-11-4-1-9(2-5-11)7-13(15(22)23)12-6-3-10(8-14(12)21)16(18,19)20/h1-8,22H,21H2
charge 0 multiplicity 1
34 atoms
Cl 7.470205 0.147578 -1.022311
F  -5.764233 1.206583 -1.010685
F  -5.380492 -0.701445 -2.162919
F  -6.009351 -0.807665 0.010661
O  1.200525 1.46355 2.33059
O  0.854028 -0.771981 2.796273
N  -1.427489 -1.999956 1.665324
C  -0.999982 -0.015036 0.239316
C  -1.87795 -1.008704 0.808306
C  0.474276 0.042736 0.507733
C  -3.747766 -0.042347 -0.476937
C  -1.540393 0.935336 -0.668478
C  -3.254079 -0.994839 0.428353
C  -2.89579 0.939131 -1.041143
C  1.366638 -0.007419 -0.535547
C  2.837502 0.076067 -0.582116
C  -5.189837 -0.084732 -0.889906
C  0.868822 0.162352 1.953539
C  3.662589 0.646873 0.430973
C  3.477888 -0.444142 -1.74611
C  5.065537 0.668597 0.300306
C  4.879096 -0.434382 -1.88957
C  5.657468 0.120403 -0.855054
H  -0.868834 1.700097 -1.072298
H  -3.931615 -1.742927 0.853771
H  -3.286534 1.691413 -1.731147
H  0.902067 -0.203802 -1.513086
H  -0.493289 -1.958962 2.083321
H  -2.087922 -2.685217 2.023948
H  3.211108 1.117517 1.306707
H  2.866346 -0.875991 -2.547175
H  5.689705 1.116779 1.078808
H  5.354524 -0.845319 -2.784451
H  1.369338 1.491057 3.314201
