program: Gaussian 09
title: 000282694
version: EM64L-G09RevD.01
frameworkgroup: C1[X(C10H16ClN5O3)]
method: RPBEPBE
basis: SDD
operation: Freq
keyword: #p
keyword: freq=noraman
keyword: PBEPBE/SDD
title: #p freq=noraman PBEPBE/SDD
converged: YES YES NO NO
title: Mulliken charges:
elementType: Cl O O O N N N N N C C C C C C C C C C H H H H H H H H H H H H H H H H
charge: -0.066326 -0.470285 -0.434114 -0.426503 -0.416151 -0.111891 -0.656589 -0.010676 -0.595892 -0.117677 -0.187104 -0.213168 -0.506160 -0.146380 -0.390682 0.208674 0.242940 -0.277035 -0.041732 0.265214 0.298940 0.252656 0.262587 0.223041 0.261792 0.209067 0.206548 0.354880 0.348676 0.341705 0.336831 0.293286 0.307031 0.330733 0.323763
chargesum: 0.00000
title: Mulliken charges with hydrogens summed into heavy atoms:
elementType: Cl O O O N N N N N C C C C C C C C C C
charge: -0.066326 -0.121609 -0.092408 -0.089672 -0.061271 -0.111891 -0.056271 -0.010676 0.058603 0.147537 0.111836 0.039488 -0.020532 0.115412 0.024933 0.208674 0.242940 -0.277035 -0.041732
polarizability: 2.13943241e+02 -1.15809656e+00 1.84631709e+02 -1.72556152e+01 -1.57685553e+00 1.11153857e+02
1716.lowfreq: -11.5453 0.0008 0.0009 0.0015 2.8445 5.1492 17.2610 22.3950 52.2924
frequency: 16.7917 22.0124 52.1969 62.2183 87.2564 109.3098 137.7232 163.1360 170.5549 189.7691 199.7529 217.5859 224.9403 232.8317 252.3938 270.3505 292.8927 301.2715 326.7398 345.8554 358.4191 368.4518 390.2766 397.0965 405.4693 444.3414 480.6211 490.5419 501.0975 532.5554 562.0002 591.2054 599.7203 630.0649 668.1706 686.3632 717.5759 758.2587 760.2292 769.2705 817.5939 838.1762 872.6946 915.1204 926.8464 939.4769 965.4933 982.8838 988.1630 993.9410 1044.1855 1061.4194 1071.7109 1087.2373 1095.2377 1105.8885 1141.4090 1161.3320 1195.5667 1205.2831 1207.7186 1228.8374 1250.2742 1265.5451 1274.3084 1299.7250 1310.2451 1325.7694 1328.6830 1333.0450 1346.3536 1355.8034 1370.4957 1378.9265 1443.8559 1460.5939 1470.3397 1481.2166 1486.0904 1545.2188 1591.3069 1611.7114 1637.0634 2956.3087 2987.6212 3000.7428 3005.5169 3053.8805 3065.9796 3082.0862 3094.9591 3445.9410 3481.7955 3550.3642 3560.9691 3561.2641 3570.5882 3613.3323 3729.8065
redmass: 5.7265 6.6051 5.8373 6.1627 5.3594 3.4301 4.6200 4.1314 6.1695 6.1892 3.9802 2.4018 1.8544 2.2058 2.2981 1.9632 2.2247 4.0278 1.6604 1.8397 1.9920 5.0319 4.1600 3.2549 1.2260 4.3581 2.6056 1.1097 4.4146 3.9257 5.6237 1.5800 3.2357 5.1940 4.5570 6.8699 1.3140 5.3443 6.8464 6.1971 4.2653 2.7098 1.9312 2.9121 3.1173 2.7304 3.1508 2.4931 2.7228 3.6214 1.7705 3.4868 1.8957 1.4582 2.3681 1.5853 1.7253 1.4286 1.5751 1.4232 1.4776 2.6139 1.3765 1.3767 1.3729 1.3885 2.2595 1.6141 1.4677 1.4782 4.6564 1.3895 1.2193 1.4142 1.9475 5.5729 1.0919 1.2504 2.5300 3.1184 2.6659 2.1076 1.2462 1.0661 1.0714 1.0833 1.0866 1.0981 1.0875 1.0877 1.0947 1.0778 1.0454 1.0662 1.0661 1.0661 1.0440 1.0997 1.1060
irintensity: 0.1208 0.6050 0.8013 0.0713 3.0372 1.8723 5.2420 5.5342 9.4507 1.8447 17.1928 23.0567 56.8129 9.1597 33.8980 17.1493 47.0190 8.9209 112.7784 146.8215 84.0121 1.7635 77.0032 11.9197 267.9491 22.8746 24.2422 2.3971 7.4343 13.8828 18.7411 206.8003 68.7014 17.5191 6.7417 8.9807 76.9359 23.2464 30.0309 25.6897 30.2930 7.8624 21.0151 14.0034 76.9752 45.2930 66.7874 18.8701 25.4461 30.9223 21.6434 36.9077 35.3442 6.4502 14.1977 63.2817 17.8777 12.7842 32.0466 12.0142 64.9940 43.7435 16.4161 13.4343 2.0122 2.3162 36.3670 30.6001 19.6939 7.3445 58.0027 18.3222 27.8072 2.0907 26.8197 69.7439 1.7282 82.8276 399.6703 770.9218 22.7001 482.7483 54.4655 59.3858 20.6491 8.9591 59.8697 33.1615 23.7227 10.7693 15.9617 130.6353 15.2195 5.5607 4.4313 8.6504 113.5265 25.2288 44.6653
temp: 298.150 k
press: 1.00000 atm
elementType: 17 8 8 8 7 7 7 7 7 6 6 6 6 6 6 6 6 6 6 1 1 1 1 1 1 1 1 1 1 1 1 1 1 1 1
symmnumber: 1
zpe: 717527.6 jmol-1
zpe.correction: 0.273292 hartree
zpe.thermalcorrener: 0.293189 hartree
zpe.thermalcorrenthalpy: 0.294133 hartree
zpe.thermalcorrgfe: 0.223892 hartree
zpe.sumelectzpe: -1348.689625 hartree
zpe.sumelectthermal: -1348.669728 hartree
zpe.sumelectthermalent: -1348.668784 hartree
zpe.sumelectthermalfe: -1348.739024 hartree
dipole: 3.3336 -1.8585 -0.8892
dipole: 3.9188
quadrupole: -138.0505 -99.3630 -123.3979
quadrupole: -11.3629 2.6661 2.1846
quadrupole: -17.7800 20.9074 -3.1274 -11.3629 2.6661 2.1846
hfenergy: -1348.9629167 hartree
pointgroup: C01 [X(C10H16Cl1N5O3)]
dipole: 1.3220173 -0.1210773 0.7840522 debye
polarizability: 206.2865237|-26.7003503|145.2442901|17.0342742|32.6813173|158.1979936 unknown
InChI: InChI=1S/C10H16ClN5O3/c11-8-5(12)9(16-10(13)15-8)14-4-1-3(2-17)6(18)7(4)19/h3-4,6-7,14,17-19H,1-2,12-13H2
charge 0 multiplicity 1
35 atoms
Cl -4.472446 2.421685 0.708372
O  2.510965 0.87146 2.042097
O  2.896914 -2.614815 0.713934
O  4.362888 0.836985 -2.383009
N  0.090524 -0.113579 0.650381
N  -1.556546 -0.723436 -0.937091
N  -1.627003 1.790248 1.828682
N  -3.698567 0.429504 -0.989009
N  -3.215144 -1.301103 -2.498825
C  3.040919 0.426252 -0.299479
C  1.069539 -1.037252 0.0514
C  3.073247 -0.169315 1.140723
C  1.92299 -0.356543 -1.062519
C  2.140025 -1.415571 1.10405
C  4.416388 0.364297 -0.992608
C  -1.176816 0.047031 0.122302
C  -2.061237 1.01857 0.728743
C  -3.298852 1.141793 0.0749
C  -2.81271 -0.512229 -1.441226
H  2.747601 1.488925 -0.191404
H  0.520807 -1.915049 -0.324568
H  4.088842 -0.460477 1.475256
H  1.298194 0.288711 -1.698968
H  2.373681 -1.110672 -1.739068
H  1.717415 -1.658557 2.093012
H  4.769813 -0.679177 -1.076264
H  5.166408 0.938965 -0.407392
H  0.46726 0.639111 1.241343
H  2.655497 0.597785 2.983389
H  3.049662 -2.60707 -0.265508
H  4.047784 1.77635 -2.390589
H  -1.211861 1.288583 2.616918
H  -2.234077 2.57006 2.087495
H  -4.137099 -1.156138 -2.899241
H  -2.578905 -2.001929 -2.865729
