program: Gaussian 09
title: 000286045
version: EM64L-G09RevD.01
frameworkgroup: C1[X(C24H27Cl2N3O)]
method: RPBEPBE
basis: SDD
operation: Freq
keyword: #p
keyword: freq=noraman
keyword: PBEPBE/SDD
title: #p freq=noraman PBEPBE/SDD
converged: NO YES NO NO
title: Mulliken charges:
elementType: Cl Cl O N N N C C C C C C C C C C C C C C C C C C C C C C C C H H H H H H H H H H H H H H H H H H H H H H H H H H H
charge: -0.014329 -0.000166 -0.230029 -0.134889 0.044126 -0.410802 0.509206 -0.500103 -0.497953 -0.489764 -0.493991 -0.417219 -0.411919 -0.462167 -0.481995 -0.386630 0.476049 -0.373478 -0.364738 -0.408773 -0.391225 0.470718 -0.394869 0.166563 0.303917 -0.342919 -0.367605 -0.076855 -0.194029 -0.096077 0.199638 0.201532 0.205816 0.195088 0.210464 0.222299 0.225353 0.203326 0.198548 0.199654 0.198339 0.206491 0.215231 0.225804 0.236600 0.216966 0.207023 0.187260 0.217594 0.216085 0.216722 0.276043 0.199368 0.286339 0.258407 0.282852 0.263101
chargesum: 0.00000
title: Mulliken charges with hydrogens summed into heavy atoms:
elementType: Cl Cl O N N N C C C C C C C C C C C C C C C C C C C C C C C C
charge: -0.014329 -0.000166 -0.230029 -0.134889 0.044126 -0.124463 0.509206 -0.098933 -0.097049 -0.057000 -0.065312 -0.019016 -0.007089 -0.021132 -0.028429 0.007653 0.476049 -0.155884 -0.148652 -0.192051 -0.115183 0.470718 -0.195500 0.166563 0.303917 -0.084512 -0.084753 -0.076855 0.069072 -0.096077
polarizability: 7.25277613e+02 2.95469402e+01 2.79845648e+02 -2.85644188e+01 1.76432263e+01 1.82842872e+02
1716.lowfreq: -1.3883 0.0015 0.0017 0.0025 1.8720 7.2236 14.6335 16.9879 23.1580
frequency: 13.6539 16.7927 22.8372 23.8636 37.6268 52.4442 55.5855 81.4047 86.9371 101.8584 110.1724 137.4332 161.1586 179.5759 183.3255 192.7685 201.4435 215.9608 243.3509 259.9285 267.9371 281.0045 303.4437 312.1738 329.9601 338.9718 369.7184 387.7364 395.5088 408.1088 416.4227 419.4270 425.7999 430.7773 442.3968 448.4272 463.7880 475.2241 493.6672 514.2060 523.6349 534.5485 554.1292 574.7274 601.5135 618.6407 633.8242 658.7450 671.0934 680.7474 705.4242 727.7180 734.8432 752.1441 776.0967 792.7304 799.3449 814.2422 826.6575 837.0077 841.6812 842.3299 872.8484 883.0640 903.1951 908.6610 919.8157 921.8335 925.2866 929.4943 952.8430 976.3990 981.2118 984.9072 992.9552 999.9412 1001.9286 1004.6222 1017.7732 1020.4755 1031.1561 1058.5675 1090.0921 1098.5750 1108.4148 1114.7385 1124.2779 1128.3390 1135.4408 1146.1754 1148.4643 1171.5975 1188.5064 1196.5155 1201.0446 1235.4467 1237.3456 1243.8446 1250.6998 1256.9271 1257.9814 1266.9541 1278.4899 1303.1312 1313.1517 1319.1056 1325.1949 1335.1315 1335.8034 1336.7899 1338.1314 1342.8222 1352.3389 1356.4961 1358.2087 1361.8746 1369.7009 1378.9403 1408.2149 1442.7297 1449.6216 1450.2342 1453.7344 1459.1191 1460.8952 1468.9245 1472.2943 1479.8115 1482.0805 1502.8932 1507.3288 1524.6749 1543.0682 1556.9014 1580.3440 1592.4090 1612.9764 1629.5814 2943.0222 2947.5960 2957.6037 2963.8887 2965.2501 2974.0557 2975.6169 2976.3779 2981.3929 2983.4639 3008.8327 3016.8415 3026.8999 3027.5719 3030.6167 3040.8557 3046.4528 3091.5097 3105.1400 3111.9932 3145.4860 3151.7725 3160.7223 3164.9781 3169.2330 3178.6158 3376.2651
redmass: 7.7021 6.7207 5.2417 7.3256 4.5644 5.3338 4.4408 5.6754 5.6892 5.1477 5.0658 3.1678 5.3528 8.8682 11.8055 3.9808 4.9813 2.6704 4.5122 3.1131 2.3586 4.9677 4.3029 5.8834 2.8440 3.1673 2.9556 2.5962 2.0548 4.5348 4.3068 3.4208 2.8451 3.8933 3.8204 2.6723 2.7876 3.3772 3.4781 5.0180 2.2316 2.6225 4.3747 3.4092 2.4447 1.3161 6.8379 6.0494 3.0135 6.0877 4.5367 3.4646 3.5193 8.7029 1.4766 1.5512 1.4342 2.0550 1.7501 3.1832 1.8344 1.6432 2.4381 1.5568 2.4915 5.4844 1.6765 1.4288 1.6622 2.6021 1.4774 1.3653 2.2002 1.4074 2.8475 1.8951 5.2222 1.6691 2.2848 6.9681 2.0096 1.8992 1.4549 1.7167 1.9639 2.0307 2.3592 3.0465 1.5239 1.5453 1.8064 1.5474 1.6143 1.5461 1.1422 1.6793 2.1394 1.5053 1.4370 1.4074 1.5790 1.2980 1.3513 1.4933 1.4607 1.4417 1.3900 1.2967 1.4538 1.8042 1.4933 1.5006 1.4978 1.4326 4.0726 1.3506 3.1415 5.4357 2.3683 1.0956 2.8337 1.2314 2.5664 1.0894 1.0979 1.0872 1.0879 1.0947 1.0912 1.1010 1.8296 3.1541 6.2608 8.2562 5.4349 6.4626 8.1912 6.4051 1.0862 1.0609 1.0612 1.0629 1.0598 1.0639 1.0630 1.0703 1.0707 1.0628 1.0973 1.0967 1.0981 1.0979 1.1019 1.1025 1.1002 1.0920 1.0917 1.0893 1.0869 1.0916 1.0886 1.0935 1.0940 1.0974 1.0751
irintensity: 0.1182 0.0107 0.1991 0.5292 2.7826 0.1437 0.6897 6.0252 5.8568 0.0782 0.0651 0.9758 0.3962 8.3546 3.0341 1.7129 2.1612 0.4623 18.7669 4.5085 2.9364 3.8823 0.6392 4.7990 10.6492 3.1599 1.1735 0.4546 0.4860 3.2262 2.6391 6.0205 2.2668 4.6175 1.9438 15.7967 0.6068 3.4591 1.2197 10.1266 18.5569 32.3408 9.6235 2.4443 7.4173 77.9693 0.8113 10.0653 0.2518 6.9198 6.2222 18.2518 2.5530 16.4838 0.5084 3.0911 13.9119 2.0451 30.0124 29.4010 11.1076 13.9376 1.4397 21.1395 14.7876 56.9604 8.8516 11.1835 20.6659 63.1633 17.1038 4.1367 36.2534 2.0580 4.2396 14.8202 40.7130 18.6862 8.5319 33.1295 12.8891 1.3953 13.3448 22.1800 6.5873 151.8859 9.2707 32.5506 6.9619 5.3453 4.5648 22.3061 44.3636 7.8253 140.2113 386.4319 52.3010 79.6478 19.8141 5.3269 25.5374 3.3042 4.7801 1.2423 7.4633 6.0612 0.8928 1.0960 13.1662 27.7311 8.0525 0.2827 17.8576 15.1980 11.9379 26.0260 26.4648 9.1449 130.3778 5.0302 44.5965 12.3625 142.1148 15.4867 8.0704 28.6047 3.1998 12.3308 10.0205 36.3423 389.7613 224.1463 40.4504 63.0735 223.5523 46.4965 323.8228 577.2438 69.3132 22.5819 24.4921 36.5611 61.8066 10.3909 22.5781 71.8780 42.8413 38.3751 45.9054 58.7095 27.6681 160.3930 21.2809 132.3658 82.9990 21.7988 14.0220 14.7559 7.3887 4.5112 0.6488 21.9189 28.3659 2.7319 41.8745
temp: 298.150 k
press: 1.00000 atm
elementType: 17 17 8 7 7 7 6 6 6 6 6 6 6 6 6 6 6 6 6 6 6 6 6 6 6 6 6 6 6 6 1 1 1 1 1 1 1 1 1 1 1 1 1 1 1 1 1 1 1 1 1 1 1 1 1 1 1
symmnumber: 1
zpe: 1212404.5 jmol-1
zpe.correction: 0.461780 hartree
zpe.thermalcorrener: 0.489281 hartree
zpe.thermalcorrenthalpy: 0.490225 hartree
zpe.thermalcorrgfe: 0.400353 hartree
zpe.sumelectzpe: -2088.136980 hartree
zpe.sumelectthermal: -2088.109480 hartree
zpe.sumelectthermalent: -2088.108535 hartree
zpe.sumelectthermalfe: -2088.198408 hartree
dipole: 7.7510 2.6427 2.0666
dipole: 8.4459
quadrupole: -175.1015 -189.4395 -195.8134
quadrupole: 3.3803 -7.8612 -0.2612
quadrupole: 11.6833 -2.6547 -9.0286 3.3803 -7.8612 -0.2612
hfenergy: -2088.5987607 hartree
pointgroup: C01 [X(C24H27Cl2N3O1)]
dipole: -3.126515 0.8607114 0.7249131 debye
polarizability: 717.4670004|61.1876193|213.3361151|-47.434702|41.1170123|257.1630178 unknown
InChI: InChI=1S/C24H27Cl2N3O/c25-21-9-6-19(16-22(21)26)23(30)28-27-17-18-4-7-20(8-5-18)29-14-12-24(13-15-29)10-2-1-3-11-24/h4-9,16-17,28H,1-3,10-15H2
charge 0 multiplicity 1
57 atoms
Cl 8.453084 1.840834 2.059054
Cl 10.434598 1.708541 -0.567058
O  4.357702 -1.163559 -1.894672
N  -4.013701 -0.844186 1.131697
N  2.37512 -0.141971 -0.161407
N  3.695313 0.291893 -0.169383
C  -6.672032 0.132631 0.138854
C  -7.795365 -0.740862 0.785737
C  -7.346776 1.224234 -0.747242
C  -5.690242 -0.728694 -0.716861
C  -5.84279 0.848358 1.251686
C  -8.80515 -1.315882 -0.23766
C  -8.344208 0.657457 -1.78495
C  -4.76204 -1.637545 0.132087
C  -4.937167 -0.129776 2.038034
C  -9.435756 -0.197049 -1.099061
C  -2.666505 -0.491883 0.983102
C  -2.095108 0.624497 1.679311
C  -1.779921 -1.257723 0.14782
C  -0.73331 0.938761 1.553001
C  -0.426498 -0.930591 0.023084
C  0.13619 0.177829 0.724106
C  1.542983 0.536241 0.611188
C  4.63722 -0.291817 -1.025346
C  6.042464 0.234061 -0.850554
C  6.53505 0.752564 0.374118
C  6.914587 0.149308 -1.965541
C  7.86741 1.201346 0.466946
C  8.24333 0.602633 -1.871454
C  8.721722 1.135718 -0.654245
H  -8.350764 -0.104614 1.506787
H  -7.360701 -1.570915 1.376524
H  -6.561256 1.817685 -1.257871
H  -7.890755 1.92667 -0.079597
H  -6.245703 -1.365182 -1.430905
H  -5.053902 -0.049767 -1.319201
H  -5.204313 1.627206 0.787304
H  -6.531026 1.362989 1.952459
H  -8.302407 -2.049762 -0.899659
H  -9.595579 -1.874328 0.300659
H  -8.808445 1.491174 -2.346546
H  -7.804854 0.039149 -2.530592
H  -4.07102 -2.176904 -0.531166
H  -5.361788 -2.402756 0.665332
H  -5.56429 -0.889749 2.546515
H  -4.376179 0.389848 2.82899
H  -10.118002 -0.631437 -1.855012
H  -10.051853 0.457364 -0.447418
H  -2.718563 1.265852 2.307666
H  -2.150078 -2.135208 -0.389726
H  -0.336575 1.80434 2.099956
H  0.231288 -1.532444 -0.612723
H  1.879741 1.409758 1.21089
H  3.975526 1.104363 0.401257
H  5.917945 0.771692 1.278336
H  6.532367 -0.285544 -2.893734
H  8.916381 0.547459 -2.731714
