program: Gaussian 09
title: 000285404
version: EM64L-G09RevD.01
frameworkgroup: C1[X(C19H20N4O2S)]
method: RPBEPBE
basis: SDD
operation: Freq
keyword: #p
keyword: freq=noraman
keyword: PBEPBE/SDD
title: #p freq=noraman PBEPBE/SDD
converged: YES YES NO NO
title: Mulliken charges:
elementType: S O O N N N N C C C C C C C C C C C C C C C C C C C H H H H H H H H H H H H H H H H H H H H
charge: 0.173615 -0.294128 -0.298797 -0.133210 -0.249098 -0.446824 -0.498765 0.351009 0.039302 0.057223 0.454101 -0.652629 -0.802816 -0.360768 -0.385253 0.248030 -0.214464 -0.210550 -0.249508 0.491596 -0.446191 -0.321084 -0.207354 -0.205318 -0.242784 -0.841152 0.255099 0.269091 0.239974 0.334998 0.232401 0.233686 0.329623 0.282682 0.266223 0.230190 0.229584 0.231914 0.301179 0.220623 0.305959 0.253479 0.248709 0.263668 0.264180 0.252555
chargesum: 0.00000
title: Mulliken charges with hydrogens summed into heavy atoms:
elementType: S O O N N N N C C C C C C C C C C C C C C C C C C C
charge: 0.173615 -0.294128 -0.298797 -0.133210 -0.249098 -0.117201 -0.197586 0.351009 0.039302 0.057223 0.454101 0.111534 -0.001731 -0.078085 -0.119030 0.248030 0.015726 0.019033 -0.017594 0.491596 -0.225568 -0.015125 0.046125 0.043390 -0.242784 -0.060748
polarizability: 4.82033015e+02 3.30685835e+00 2.49594352e+02 -4.78818447e+00 1.99652601e+01 1.50769740e+02
1716.lowfreq: -0.0016 -0.0013 -0.0004 2.0437 4.0654 6.5463 14.4039 21.3676 26.2416
frequency: 13.5583 21.1980 26.2179 39.7113 42.7533 57.3803 69.9782 77.5596 88.7160 109.4214 131.7829 141.0132 155.8371 163.3978 173.0500 195.1107 202.8320 222.9588 238.0667 253.8236 266.4247 287.6684 298.3378 332.9480 342.9207 364.3726 372.6438 389.7774 408.8507 412.6319 418.8022 442.2591 500.0885 509.9015 549.4936 564.7724 569.3796 612.7973 617.0515 622.2880 631.3879 642.4226 644.6248 691.4226 695.0730 707.8263 714.9311 720.7181 723.8940 757.7967 768.3526 825.0675 826.3630 844.8735 850.0388 862.0936 914.5719 923.0000 949.8377 962.6662 973.1288 986.1437 986.3239 989.2802 992.3498 995.2311 998.7475 1020.0873 1036.0199 1053.2827 1064.4024 1079.7221 1086.0106 1103.4322 1114.1900 1128.7937 1164.4290 1173.5561 1186.0427 1187.3995 1193.3292 1246.0046 1257.8167 1286.9441 1292.7989 1321.0398 1338.2850 1344.2452 1353.2013 1362.5291 1385.8773 1402.3248 1407.3860 1432.1321 1443.7236 1445.9190 1459.8430 1461.8931 1474.3556 1479.5256 1485.5480 1487.2930 1496.7918 1505.0762 1537.8426 1586.4583 1589.2902 1601.9710 1607.5196 1614.3868 1647.2311 1672.9249 2970.2807 2972.0497 3007.3612 3049.2785 3088.5134 3108.5736 3110.4306 3130.5317 3131.0762 3131.2926 3132.1767 3141.4862 3146.0563 3155.6531 3157.2473 3167.3647 3186.9101 3197.3119 3388.5160 3526.0961
redmass: 5.4402 3.4977 4.1905 6.4646 6.5555 4.0616 6.2475 4.5514 4.9255 4.1602 2.9905 1.2215 4.0766 4.5685 4.6834 2.8670 1.2959 1.4360 2.8923 4.6238 6.7461 3.0256 6.9430 3.2774 4.3547 5.2839 5.2716 6.4634 2.9644 2.9897 5.9505 5.1691 3.4280 1.9274 2.0306 4.4859 4.2693 6.4466 6.8845 5.9576 6.1154 7.2200 5.8982 4.4849 2.4760 5.5892 3.4881 3.8014 1.7725 2.2147 2.8392 5.7466 1.4348 1.2770 5.3030 1.3978 1.5353 2.6022 1.3455 1.1725 1.3678 1.2815 4.9011 1.3236 1.4212 4.6879 4.1468 3.5893 1.9744 1.4471 2.6508 2.6623 1.6737 1.6639 1.3716 2.0556 3.4537 1.0515 1.1173 1.1399 2.9356 3.3280 2.3480 2.3363 1.6225 1.4433 1.1313 3.6121 4.1450 4.5546 8.8132 3.7621 1.3501 1.1728 1.0581 2.2148 1.0553 1.0693 1.0957 2.3097 1.7036 1.2885 1.0666 2.4506 2.1330 5.6026 6.1359 7.8249 6.0166 6.7620 3.8647 8.2876 1.0399 1.0433 1.0278 1.0960 1.0899 1.0979 1.0896 1.0916 1.0950 1.1060 1.1037 1.0893 1.0910 1.0940 1.0950 1.0992 1.0966 1.0943 1.0757 1.0762
irintensity: 0.2785 2.1656 3.9565 0.5587 0.1538 3.0260 7.4918 1.3423 0.4085 3.6113 3.6150 1.1875 6.6485 0.9414 15.2056 0.2233 0.7897 0.4217 0.9415 1.5982 12.9817 7.3635 6.6181 2.3795 2.6692 10.5661 4.4693 0.9261 0.4369 0.0432 26.8954 1.4682 11.2121 47.7092 5.2574 32.0508 0.5577 3.7907 24.9215 2.1054 3.2439 0.5063 22.9811 2.8947 15.8323 23.6645 48.9761 6.2911 117.5315 44.3185 42.0684 2.2279 50.2686 0.5616 7.1264 48.4011 3.6711 3.1303 0.6069 5.8892 0.8933 36.7109 0.1835 6.6244 0.7499 3.5121 7.9833 41.3450 1.9621 3.6998 9.2583 0.9077 21.0249 49.6727 14.6554 10.2211 0.5795 0.2298 12.3668 1.7287 1.9637 146.7937 349.9456 159.3425 2.0250 63.6074 0.9386 40.6157 51.0224 561.4561 0.7961 21.0112 39.7345 7.4576 19.8929 21.9544 11.2003 2.8796 145.0091 93.2541 139.0247 106.2893 16.8534 792.8363 744.3395 91.4774 22.3299 145.1501 68.0923 151.9816 39.1452 83.3793 22.5483 105.2328 36.9544 21.2753 14.6046 21.2374 20.8928 8.3097 3.8914 17.9072 17.1970 12.2492 6.6253 26.0053 6.0283 20.0772 1.9638 6.9987 138.0762 13.9000
temp: 298.150 k
press: 1.00000 atm
elementType: 16 8 8 7 7 7 7 6 6 6 6 6 6 6 6 6 6 6 6 6 6 6 6 6 6 6 1 1 1 1 1 1 1 1 1 1 1 1 1 1 1 1 1 1 1 1
symmnumber: 1
zpe: 941479.2 jmol-1
zpe.correction: 0.358590 hartree
zpe.thermalcorrener: 0.383786 hartree
zpe.thermalcorrenthalpy: 0.384730 hartree
zpe.thermalcorrgfe: 0.300295 hartree
zpe.sumelectzpe: -1501.674842 hartree
zpe.sumelectthermal: -1501.649647 hartree
zpe.sumelectthermalent: -1501.648703 hartree
zpe.sumelectthermalfe: -1501.733138 hartree
dipole: -4.4222 1.1278 0.5288
dipole: 4.5943
quadrupole: -149.7463 -149.0874 -159.8774
quadrupole: -17.1551 11.8701 2.4562
quadrupole: 3.1574 3.8163 -6.9737 -17.1551 11.8701 2.4562
hfenergy: -1502.0334327 hartree
pointgroup: C01 [X(C19H20N4O2S1)]
dipole: 1.7621416 0.3982166 0.0586131 debye
polarizability: 478.6507302|0.6671321|207.3949774|-31.1352813|53.0888797|196.3514001 unknown
InChI: InChI=1S/C19H20N4O2S/c1-13-17(18(24)23(22(13)2)15-7-5-4-6-8-15)21-19(25)20-14-9-11-16(26-3)12-10-14/h4-12,20-21H,1-3H3
charge 0 multiplicity 1
46 atoms
S  -8.416046 0.073283 0.862064
O  2.014129 -1.537954 -1.337771
O  -1.430519 0.973195 1.455624
N  3.246977 0.823488 1.029873
N  3.469205 -0.166813 0.01604
N  -0.097817 -0.418022 0.104646
N  -2.406819 -0.649513 0.043202
C  1.843464 0.844658 1.302742
C  1.214951 -0.034504 0.431112
C  2.227555 -0.699728 -0.399769
C  4.699689 -0.213515 -0.708833
C  4.200399 0.777214 2.169344
C  1.344235 1.724902 2.411239
C  5.076858 -1.423248 -1.345141
C  5.522458 0.937744 -0.809298
C  -1.316957 0.042404 0.60202
C  6.284634 -1.473089 -2.072257
C  6.736248 0.865125 -1.525072
C  7.124801 -0.33818 -2.158133
C  -3.790871 -0.425198 0.269427
C  -4.705236 -1.267605 -0.422192
C  -4.292397 0.579432 1.141791
C  -6.094667 -1.107235 -0.254765
C  -5.685901 0.724177 1.304327
C  -6.596076 -0.105215 0.608959
C  -8.757981 1.516651 -0.31692
H  4.006056 1.646672 2.814939
H  5.231372 0.845175 1.791048
H  4.090418 -0.154212 2.759645
H  0.248028 1.789894 2.349248
H  1.776589 2.739489 2.333774
H  1.607637 1.318348 3.407387
H  -0.077628 -1.112274 -0.658577
H  4.41909 -2.293316 -1.282902
H  5.192001 1.880745 -0.361978
H  6.571549 -2.406345 -2.568839
H  7.369408 1.755944 -1.601926
H  8.064781 -0.38831 -2.717845
H  -2.196497 -1.417573 -0.59803
H  -4.32967 -2.050454 -1.094301
H  -3.592352 1.217944 1.682327
H  -6.791827 -1.759821 -0.789938
H  -6.070415 1.48637 1.990697
H  -8.514312 1.22556 -1.349962
H  -8.166893 2.394935 -0.015754
H  -9.833453 1.739182 -0.229671
