program: Gaussian 09
title: 000283021
version: EM64L-G09RevD.01
frameworkgroup: C1[X(C16H10F3NO4)]
method: RPBEPBE
basis: SDD
operation: Freq
keyword: #p
keyword: freq=noraman
keyword: PBEPBE/SDD
title: #p freq=noraman PBEPBE/SDD
converged: YES YES NO NO
title: Mulliken charges:
elementType: F F F O O O O N C C C C C C C C C C C C C C C C H H H H H H H H H H
charge: -0.166462 -0.164401 -0.164569 -0.412006 -0.223742 -0.198933 -0.188215 0.022519 0.396861 0.187661 0.326257 -0.314762 0.291527 -0.384639 -0.347190 -0.349724 -0.358082 0.200797 -0.351323 0.255061 -0.366529 -0.233388 0.028806 -0.210721 0.270199 0.244446 0.254667 0.263216 0.264204 0.262392 0.289288 0.244488 0.246692 0.385607
chargesum: 0.00000
title: Mulliken charges with hydrogens summed into heavy atoms:
elementType: F F F O O O O N C C C C C C C C C C C C C C C C
charge: -0.166462 -0.164401 -0.164569 -0.026400 -0.223742 -0.198933 -0.188215 0.022519 0.396861 0.187661 0.326257 -0.044564 0.291527 -0.140193 -0.092523 -0.086509 -0.093878 0.200797 -0.088931 0.255061 -0.077241 0.011100 0.028806 0.035971
polarizability: 3.50637754e+02 -1.23391303e+01 1.79100428e+02 1.58896932e+01 4.97106842e+00 1.38438145e+02
1716.lowfreq: -5.1052 -0.0008 -0.0007 -0.0004 2.6043 2.8545 11.0801 23.0469 27.0057
frequency: 10.9526 23.0286 26.9263 33.2346 52.5315 59.2806 70.3791 84.4849 105.3326 146.4184 155.4003 160.7919 187.0012 231.4263 249.2323 285.3376 313.6089 338.6463 366.9449 381.9169 386.8625 402.2495 405.8698 429.0546 454.2476 473.7273 504.8513 516.7942 535.0845 557.9965 570.2382 600.3687 614.0824 628.9128 633.7291 653.0909 665.2400 686.7047 727.4630 735.3274 748.9005 768.3513 782.5230 789.1107 830.0374 841.5624 847.6308 873.1933 897.9102 939.6827 966.5150 977.7592 982.6828 983.3641 994.6108 1004.2182 1023.2768 1031.2713 1038.3854 1060.9811 1072.2695 1138.2501 1142.9338 1173.8283 1202.2214 1208.2724 1210.6859 1250.7445 1272.8836 1284.5673 1289.0078 1319.3417 1348.6686 1363.8669 1376.8348 1386.1443 1415.0573 1432.9741 1467.5729 1509.4262 1567.3508 1574.9116 1593.6169 1608.5882 1624.1852 1626.7029 3137.8051 3141.9844 3144.2583 3156.3499 3160.6269 3169.2652 3170.3171 3181.3411 3187.9939 3511.6034
redmass: 15.9906 8.7709 7.9495 8.5084 5.8897 9.6722 6.7560 7.7776 7.7241 5.1824 8.8534 10.1156 8.5233 6.1565 8.7848 7.3809 8.5701 8.6701 8.9911 7.4744 6.1268 3.7994 4.0761 3.8737 5.9649 3.7708 4.9821 9.0250 4.9262 4.1173 5.2770 3.3072 1.5576 8.3464 5.7888 6.6548 5.9678 4.4570 5.3091 5.4233 4.2368 6.6798 3.2025 1.9158 1.9298 1.6952 1.8801 1.6058 1.4546 4.7069 1.6076 1.3995 4.0674 1.5089 7.1583 1.3397 8.9818 2.9806 2.7598 3.1954 2.2831 1.9684 1.4368 1.1473 3.6148 1.2434 2.3109 1.8348 2.4006 2.6043 2.2050 1.2859 3.9832 4.7121 5.0415 4.1499 3.3681 2.5865 2.5906 2.6185 6.6184 6.7758 7.4054 7.1471 6.4138 8.7414 1.0881 1.0869 1.0882 1.0917 1.0889 1.0962 1.0963 1.0970 1.0973 1.0641
irintensity: 0.1337 1.7725 1.4857 0.0502 0.3107 1.2621 1.4873 1.7387 1.4030 0.5978 0.9155 0.4324 2.0214 0.5321 10.0661 3.1946 1.4319 3.2154 4.8952 1.1990 15.9210 0.8269 0.4637 0.3359 4.6929 11.1412 2.7946 1.8155 3.9194 12.0480 6.2152 36.2302 90.8733 10.4596 12.5798 11.2448 14.5469 15.8555 2.9273 11.0345 2.1396 5.2742 12.2024 50.4567 65.0659 16.2908 3.9483 31.5237 10.3270 95.6579 51.4608 4.4187 162.9243 28.5544 137.2923 0.0154 175.4268 108.0921 7.0817 23.5434 97.1220 5.6822 3.6228 23.1117 160.7695 22.2269 43.5663 17.2380 2.1910 308.3301 170.1128 3.4551 112.6148 110.3144 3.6362 23.1877 23.6661 3.1968 42.9262 0.2545 12.0261 2.8326 42.7446 15.9812 30.2294 261.6582 9.0780 1.8970 3.3649 8.7387 1.8912 3.4899 10.5485 1.8894 7.6119 37.8034
temp: 298.150 k
press: 1.00000 atm
elementType: 9 9 9 8 8 8 8 7 6 6 6 6 6 6 6 6 6 6 6 6 6 6 6 6 1 1 1 1 1 1 1 1 1 1
symmnumber: 1
zpe: 599742.9 jmol-1
zpe.correction: 0.228430 hartree
zpe.thermalcorrener: 0.249374 hartree
zpe.thermalcorrenthalpy: 0.250319 hartree
zpe.thermalcorrgfe: 0.174293 hartree
zpe.sumelectzpe: -1269.103260 hartree
zpe.sumelectthermal: -1269.082316 hartree
zpe.sumelectthermalent: -1269.081372 hartree
zpe.sumelectthermalfe: -1269.157397 hartree
dipole: 6.4274 3.4289 2.5998
dipole: 7.7348
quadrupole: -140.4052 -146.4208 -130.3239
quadrupole: 14.2666 12.2317 -9.4796
quadrupole: -1.3552 -7.3708 8.7260 14.2666 12.2317 -9.4796
hfenergy: -1269.3316905 hartree
pointgroup: C01 [X(C16H10F3N1O4)]
dipole: 2.5453134 1.6481671 0.2559229 debye
polarizability: 350.5177783|-5.0184042|174.0679639|19.8972577|-14.5776964|143.5905852 unknown
InChI: InChI=1S/C16H10F3NO4/c17-16(18,19)12-7-5-10(6-8-12)13(15(21)22)9-11-3-1-2-4-14(11)20(23)24/h1-9,21H
charge 0 multiplicity 1
34 atoms
F  -5.846401 0.211377 1.702133
F  -6.220702 0.333808 -0.536922
F  -5.712505 -1.652297 0.424237
O  1.937329 0.975882 -2.182723
O  0.078871 2.35866 -2.112208
O  4.274199 -3.068264 0.351085
O  2.071792 -2.508498 0.236728
N  3.322692 -2.196865 0.363795
C  -1.153553 0.40732 -0.220952
C  0.311405 0.578573 -0.439836
C  2.679114 0.244741 0.473993
C  1.225847 -0.024967 0.395149
C  -3.93416 0.001807 0.217355
C  -1.667105 0.209958 1.092196
C  -2.072785 0.421118 -1.30612
C  -3.039796 0.002192 1.313369
C  -3.447682 0.213962 -1.09299
C  3.680738 -0.767133 0.529393
C  3.128175 1.58991 0.597364
C  -5.393574 -0.26168 0.445187
C  5.052307 -0.469044 0.696899
C  4.490636 1.903345 0.766076
C  0.727213 1.403857 -1.61865
C  5.459384 0.871561 0.819496
H  0.83538 -0.726101 1.140756
H  -0.991417 0.24833 1.952944
H  -1.714661 0.595009 -2.323991
H  -3.419517 -0.134686 2.330384
H  -4.141708 0.227513 -1.938519
H  2.381553 2.390701 0.582775
H  5.768913 -1.294021 0.717168
H  4.797254 2.950003 0.863822
H  6.518686 1.110975 0.953737
H  2.163981 1.573152 -2.94673
