program: Gaussian 09
title: 000291482
version: EM64L-G09RevD.01
frameworkgroup: C1[X(C24H26N2O6S2)]
method: RPBEPBE
basis: SDD
operation: Freq
keyword: #p
keyword: freq=noraman
keyword: PBEPBE/SDD
title: #p freq=noraman PBEPBE/SDD
converged: YES YES NO NO
title: Mulliken charges:
elementType: S S O O O O O O N N C C C C C C C C C C C C C C C C C C C C C C C C H H H H H H H H H H H H H H H H H H H H H H H H H H
charge: 0.896899 0.867254 -0.535975 -0.507713 -0.543351 -0.542432 -0.267880 -0.234853 -0.448716 -0.454050 0.053469 0.295481 -0.079922 0.476490 0.434201 -0.624028 -0.482215 -0.866741 -0.832253 -0.006184 -0.826033 0.289021 -0.029919 -0.254767 -0.239043 -0.205270 -0.218756 -0.254306 -0.241671 -0.222849 -0.213504 -0.204978 -0.216715 -0.501672 0.242747 0.299359 0.261070 0.221204 0.270686 0.321998 0.296801 0.227828 0.237031 0.269457 0.246441 0.264604 0.223384 0.281623 0.315626 0.239057 0.265924 0.293732 0.280594 0.237561 0.243038 0.242095 0.238586 0.236114 0.242625 0.243796
chargesum: 0.00000
title: Mulliken charges with hydrogens summed into heavy atoms:
elementType: S S O O O O O O N N C C C C C C C C C C C C C C C C C C C C C C C C
charge: 0.896899 0.867254 -0.535975 -0.507713 -0.543351 -0.542432 -0.267880 -0.234853 -0.448716 -0.157249 0.053469 0.295481 -0.079922 0.476490 0.434201 -0.381281 0.078214 -0.052853 -0.097937 -0.006184 -0.091603 0.289021 -0.029919 0.026856 0.076583 0.033787 0.047168 0.039426 0.038923 0.014712 0.029534 0.037117 0.021871 0.220862
polarizability: 5.15551565e+02 1.60793175e+01 3.30449026e+02 1.67856547e+01 4.59010165e+01 2.90442810e+02
1716.lowfreq: -8.8069 -6.9663 0.0008 0.0011 0.0013 2.9802 13.3181 14.5021 20.3857
frequency: 12.5363 14.1899 20.0682 23.7547 28.7371 33.0422 43.8005 47.8841 54.8257 58.6966 61.0435 80.0792 85.1016 92.8371 104.9227 120.2572 125.5319 134.5655 138.9563 154.2544 158.0566 160.9707 172.7873 179.2019 188.3579 190.8481 196.4136 223.2426 226.9297 243.1736 246.5327 247.8290 262.0763 293.4982 296.2618 324.7773 326.8857 336.4154 354.8151 366.8219 371.6227 376.0896 382.8478 404.2660 404.9524 413.7213 416.2104 444.4176 467.0905 484.6085 499.2616 503.1449 511.7807 546.7371 553.4255 565.8246 599.6383 600.1244 602.5566 654.9865 656.8598 662.4788 679.1354 687.0901 691.7372 713.2635 759.4969 760.2629 767.3277 788.3487 798.1346 823.1536 835.4360 849.3157 850.2495 880.9166 896.5535 922.1486 926.8157 934.9799 935.3409 946.4230 961.3389 976.1353 977.6821 982.2132 984.6571 984.8835 1003.5795 1004.6448 1008.0548 1009.2420 1011.5964 1024.1765 1028.8670 1039.6596 1041.2020 1045.7358 1047.8057 1049.8580 1050.9881 1076.8439 1080.9387 1112.7884 1125.6676 1147.4372 1158.9113 1172.3588 1172.9481 1177.6810 1179.6705 1198.6451 1242.8301 1269.0379 1286.8904 1302.9379 1304.7166 1312.7806 1342.4386 1359.8099 1382.3344 1383.8408 1387.1862 1392.5157 1396.3700 1400.0850 1412.4903 1420.0125 1425.3786 1435.5169 1436.5815 1449.8716 1451.5966 1452.8875 1452.9217 1459.6676 1464.2392 1474.2156 1477.6062 1485.2933 1487.4158 1548.3745 1572.5950 1577.1423 1588.7840 1601.3777 1603.0710 1656.7027 2911.6886 2966.7613 2974.3475 2982.1332 3005.9144 3040.1745 3041.0944 3062.5621 3066.2502 3104.1031 3105.3845 3108.5469 3116.4822 3125.6624 3136.9286 3140.2751 3146.5871 3151.3635 3155.3571 3155.5370 3164.7586 3166.8297 3172.0038 3174.8043 3183.7161 3306.7026
redmass: 5.9535 5.5542 5.5713 5.3125 5.5948 6.1658 5.2567 5.1869 5.0692 5.6748 4.7943 4.2522 1.2654 2.5865 2.3421 1.2875 1.7645 3.8971 4.7327 4.9017 4.9717 6.8049 4.9355 4.2284 3.8303 4.0168 8.6959 8.4143 4.3059 2.2972 8.7336 1.5077 2.7411 5.0130 2.6533 3.9528 4.2134 6.2125 7.6736 7.5411 5.5142 4.1558 8.2504 2.8443 2.8618 5.5366 6.4913 6.2170 4.6494 4.7541 4.1990 4.5305 5.3464 3.0899 4.3778 4.3802 3.6468 5.5689 6.3641 6.8123 6.6165 5.5723 5.8347 2.4863 2.4002 5.9620 1.4322 1.4289 3.6984 12.1157 14.3150 3.1877 6.6479 1.2528 1.2438 1.2793 4.0541 3.5682 8.4384 1.3564 1.3790 6.4264 1.7698 6.0910 5.9887 2.2897 1.4067 1.3946 1.8642 1.3375 3.9881 2.2528 1.6879 2.4022 1.9883 1.6328 1.5686 2.0766 2.0556 1.7854 1.7558 1.5462 1.5566 1.3090 3.9724 1.4305 4.8174 1.0556 1.0563 1.1220 1.1205 1.4806 2.0786 1.7283 1.6646 1.3013 1.2914 5.6219 1.3588 4.6890 8.2569 8.4001 3.4917 1.3535 1.1934 1.2300 2.0334 1.1811 1.1627 2.2377 2.2736 2.0165 1.2516 1.3476 1.1985 1.1194 1.0504 1.2109 1.2061 1.0743 1.0551 5.0614 5.8793 5.8443 5.8407 6.9081 6.9324 9.0527 1.0665 1.0427 1.0443 1.0395 1.0294 1.0897 1.0936 1.0922 1.0892 1.1003 1.0987 1.1047 1.0958 1.0916 1.0857 1.0864 1.0885 1.1049 1.0903 1.0926 1.0968 1.0918 1.0972 1.1014 1.1002 1.0737
irintensity: 0.7299 0.5588 0.6554 0.0655 2.0359 1.2661 0.2541 1.1323 1.0375 0.9879 0.5408 1.2132 0.1642 2.3847 7.1059 0.7644 0.7888 4.2287 10.0735 3.1856 18.7182 3.1927 2.9835 0.6144 2.0208 5.5256 12.0709 0.8085 16.7850 2.6802 13.6614 5.0328 30.7321 11.4620 0.6224 8.6486 3.1028 0.6910 3.1418 8.1492 28.6244 3.5379 5.3596 0.0258 1.3967 23.3018 107.0870 55.7511 6.6299 16.4707 12.3941 67.6348 69.8016 1.6763 3.8772 2.3821 7.5845 1.9945 0.2167 1.7848 3.1831 15.9525 1.8145 34.0173 27.9983 12.2352 86.1122 71.3495 7.4043 57.6821 85.3719 9.9138 8.3082 2.3124 0.5925 9.4261 107.0498 35.6230 52.8723 0.4552 3.2196 3.8293 43.4336 5.1956 8.3425 2.1984 0.3162 0.4500 1.1662 1.0562 3.9081 0.5963 3.2735 40.5657 34.3104 11.6604 5.6088 12.3437 26.2943 1.2701 12.6868 6.6081 4.7319 21.2204 421.1816 3.8487 4.5377 0.8309 0.2787 15.0143 1.7174 12.7514 50.1269 6.5185 0.7133 2.6703 4.1149 49.7868 29.5387 6.5077 8.2764 4.9888 5.0945 20.8721 18.0171 7.9898 28.6729 30.8552 24.8076 11.2786 18.5028 10.0626 13.9630 25.5410 10.4743 20.7001 15.5510 19.3099 27.3627 20.8578 24.0158 17.6212 1.4380 14.2205 110.0139 0.5351 0.8048 116.7807 52.8242 15.3726 24.3201 14.6465 37.7515 15.0981 8.7562 20.3331 11.4133 5.7784 8.5040 23.6908 2.0443 21.3974 0.8392 3.4214 8.3136 16.6082 11.3093 2.2372 5.8722 3.6324 6.8787 37.1026 10.5406 15.3605
temp: 298.150 k
press: 1.00000 atm
elementType: 16 16 8 8 8 8 8 8 7 7 6 6 6 6 6 6 6 6 6 6 6 6 6 6 6 6 6 6 6 6 6 6 6 6 1 1 1 1 1 1 1 1 1 1 1 1 1 1 1 1 1 1 1 1 1 1 1 1 1 1
symmnumber: 1
zpe: 1185496.0 jmol-1
zpe.correction: 0.451532 hartree
zpe.thermalcorrener: 0.487821 hartree
zpe.thermalcorrenthalpy: 0.488765 hartree
zpe.thermalcorrgfe: 0.378558 hartree
zpe.sumelectzpe: -2284.299512 hartree
zpe.sumelectthermal: -2284.263222 hartree
zpe.sumelectthermalent: -2284.262278 hartree
zpe.sumelectthermalfe: -2284.372485 hartree
dipole: 3.8285 -4.1293 3.0438
dipole: 6.4011
quadrupole: -175.0660 -199.8503 -218.2184
quadrupole: -0.7543 -20.4387 6.2471
quadrupole: 22.6456 -2.1388 -20.5068 -0.7543 -20.4387 6.2471
hfenergy: -2284.7510433 hartree
pointgroup: C01 [X(C24H26N2O6S2)]
dipole: 1.4414598 1.633773 -1.263019 debye
polarizability: 517.2778115|-8.157894|333.9795913|-14.9115288|42.5079275|285.1859986 unknown
InChI: InChI=1S/C18H21N2O4S.C6H5O2S/c1-12-10-13(2)18(14(3)17(12)19)20(11-16(21)24-4)25(22,23)15-8-6-5-7-9-15;7-9(8)6-4-2-1-3-5-6/h5-10,19H,11H2,1-4H3;1-5H
charge 0 multiplicity 1
60 atoms
S  -2.839261 -0.926125 1.657793
S  2.984255 -0.516576 -0.516088
O  -4.432915 -1.290494 1.725104
O  -2.043531 -0.4220 2.988497
O  2.408051 -0.873356 0.97771
O  3.023787 -1.650043 -1.701735
O  -5.383253 1.745634 -1.874852
O  -3.988341 -0.067418 -2.32389
N  -2.726147 0.41129 0.23286
N  1.905839 1.119769 -1.308935
C  -1.519169 1.179731 0.288426
C  -0.456103 0.789522 -0.579849
C  0.815457 1.45618 -0.473782
C  -1.33555 2.254956 1.227218
C  1.016642 2.504689 0.484201
C  -0.073786 2.89188 1.287685
C  -4.036401 0.986519 -0.057856
C  -0.646658 -0.295562 -1.61912
C  -2.437105 2.720339 2.157918
C  -1.898041 -2.385977 0.938021
C  2.3642 3.17255 0.633298
C  -4.416216 0.797327 -1.532229
C  4.749639 0.111427 -0.280877
C  -2.632042 -3.331423 0.203373
C  -0.515262 -2.455838 1.171469
C  -1.919237 -4.428455 -0.331858
C  0.177892 -3.554206 0.6104
C  5.148675 0.494893 1.009279
C  5.594233 0.129914 -1.402599
C  -0.521272 -4.534234 -0.132426
C  6.482644 0.932935 1.178503
C  6.923036 0.575878 -1.213016
C  7.361847 0.978881 0.070655
C  -5.926578 1.641972 -3.25225
H  0.068735 3.704453 2.009861
H  -4.802669 0.437854 0.538233
H  -4.12824 2.057631 0.195609
H  -0.42602 0.084255 -2.637216
H  0.020878 -1.159126 -1.439746
H  -1.688933 -0.645354 -1.618793
H  1.591125 0.579733 -2.144013
H  -3.123558 3.425764 1.648725
H  -2.010993 3.249715 3.02629
H  -3.03201 1.877593 2.545118
H  3.020687 2.581839 1.301255
H  2.879952 3.238471 -0.338782
H  2.264691 4.179335 1.073331
H  -3.712062 -3.218757 0.067796
H  0.016349 -1.691363 1.745259
H  -2.454631 -5.191022 -0.906952
H  1.260781 -3.620476 0.748921
H  4.450555 0.420553 1.849855
H  5.235141 -0.213135 -2.37786
H  0.025739 -5.380202 -0.562433
H  6.832045 1.23054 2.172606
H  7.611113 0.602864 -2.064289
H  8.393335 1.320165 0.209606
H  -6.660522 2.456226 -3.3260
H  -5.11669 1.765657 -3.990452
H  -6.405127 0.659204 -3.399286
