program: Gaussian 09
title: 000281048
version: EM64L-G09RevD.01
frameworkgroup: C1[X(C14H11N3)]
method: RPBEPBE
basis: SDD
operation: Freq
keyword: #pfreq=noraman
keyword: PBEPBE/SDD
title: #p freq=noraman PBEPBE/SDD
converged: NO YES NO NO
title: Mulliken charges:
elementType: N N N C C C C C C C C C C C C C C H H H H H H H H H H H
charge: -0.337824 -0.064127 -0.080851 0.234094 0.361752 0.406757 -0.441855 -0.349654 -0.398097 -0.332479 -0.376831 -0.229792 -0.220724 -0.212658 -0.208794 -0.237695 -0.242659 0.275291 0.262921 0.248333 0.269065 0.274742 0.233433 0.231580 0.233390 0.234163 0.234520 0.233999
chargesum: 0.00000
title: Mulliken charges with hydrogens summed into heavy atoms:
elementType: N N N C C C C C C C C C C C C C C
charge: -0.337824 -0.064127 -0.080851 0.234094 0.361752 0.406757 -0.166564 -0.086733 -0.149763 -0.063414 -0.102089 0.003641 0.010856 0.020732 0.025369 -0.003175 -0.008660
polarizability: 2.12552267e+02 -2.01590534e-01 1.93167050e+02 -2.26674356e+01 7.19077707e-01 9.96283261e+01
1716.lowfreq: -10.3205 -0.0005 -0.0003 0.0007 4.7113 8.3269 35.5134 43.0690 67.2488
frequency: 34.9421 42.9263 67.2418 109.2711 119.9989 148.1011 241.2641 289.8905 299.7449 341.7431 385.7329 404.2615 408.1257 483.3963 503.6140 546.3267 611.4555 615.2194 656.3176 672.3909 677.2719 691.9392 696.2130 702.4967 764.5182 768.9212 809.3817 841.9132 853.5157 890.6690 920.2207 926.2625 929.6316 974.2164 976.5020 980.1689 988.8792 989.2037 995.3828 999.4179 1022.3778 1032.9731 1077.4828 1081.7484 1090.0383 1101.4713 1174.1033 1175.3858 1185.7211 1193.6800 1202.2508 1250.5589 1280.6793 1318.9253 1320.1872 1371.9185 1384.8262 1390.3139 1437.7147 1444.2977 1464.7045 1489.2694 1538.9946 1584.9777 1597.9586 1611.0712 1616.8450 3130.2415 3135.3068 3136.9819 3146.2125 3148.7528 3158.1686 3160.8883 3171.0611 3171.7363 3180.3999 3244.7828
redmass: 3.8631 4.4049 4.4743 5.7479 5.2957 5.1032 4.5808 6.1118 5.1630 5.9579 6.1877 2.8354 2.8563 5.3795 3.5410 4.0339 6.4915 6.4529 8.8059 6.6934 3.8716 3.0425 2.5406 2.1450 1.7027 1.7067 1.4648 1.2567 1.2475 4.9488 1.4848 1.5216 6.1993 1.4120 4.8637 1.5423 6.0951 6.0423 1.3164 1.3208 2.7016 1.9598 2.0904 1.6392 2.3904 1.8286 1.0521 1.0540 1.1109 1.1396 8.8987 3.9746 2.4627 1.4281 1.3210 4.6410 9.2040 5.8984 2.3632 2.3754 2.3411 2.6858 5.7381 6.0240 6.6844 6.1582 6.1960 1.0850 1.0854 1.0880 1.0896 1.0927 1.0966 1.0941 1.1017 1.0971 1.0993 1.0992
irintensity: 0.2926 0.3059 0.2912 0.0883 2.2467 1.5276 0.6073 2.2352 1.3226 0.3633 0.8082 0.0510 0.0744 6.0354 3.2034 17.0782 0.2115 0.2727 1.3625 7.8490 1.7351 13.3266 35.5071 36.3331 85.0924 71.9994 19.9249 0.3421 0.3922 63.7759 8.1862 5.0376 9.8167 0.4741 4.8515 2.0378 0.3379 0.3615 0.3299 0.1984 8.1288 5.1918 4.2169 13.2726 8.8294 5.9153 0.0866 0.0087 1.7094 0.3929 27.7404 6.1344 1.7877 1.1217 0.6548 3.0602 0.3517 12.2736 15.3383 9.3392 17.8805 71.9530 2.9153 0.9432 3.4427 20.4665 3.3333 1.7691 0.1710 0.8733 9.9636 17.3181 31.3658 25.4859 14.6343 9.2972 4.3400 1.6274
temp: 298.150 k
press: 1.00000 atm
elementType: 7 7 7 6 6 6 6 6 6 6 6 6 6 6 6 6 6 1 1 1 1 1 1 1 1 1 1 1
symmnumber: 1
zpe: 565736.1 jmol-1
zpe.correction: 0.215478 hartree
zpe.thermalcorrener: 0.228445 hartree
zpe.thermalcorrenthalpy: 0.229389 hartree
zpe.thermalcorrgfe: 0.174521 hartree
zpe.sumelectzpe: -703.147621 hartree
zpe.sumelectthermal: -703.134654 hartree
zpe.sumelectthermalent: -703.133710 hartree
zpe.sumelectthermalfe: -703.188578 hartree
dipole: -1.8504 -5.1938 -0.0533
dipole: 5.5138
quadrupole: -84.4044 -107.3472 -97.0392
quadrupole: -8.0947 -6.1297 -0.0603
quadrupole: 11.8592 -11.0836 -0.7756 -8.0947 -6.1297 -0.0603
hfenergy: -703.3630987 hartree
pointgroup: C01 [X(C14H11N3)]
dipole: 0.9496662 1.9269073 -0.3017048 debye
polarizability: 208.6811661|3.2179667|189.4458111|29.8195224|-18.888958|107.2206663 unknown
InChI: InChI=1S/C14H11N3/c1-3-7-12(8-4-1)14-11-15-16-17(14)13-9-5-2-6-10-13/h1-11H
charge 0 multiplicity 1
28 atoms
N  -0.84525 -1.096389 0.172462
N  -1.556035 -2.33074 0.34026
N  -0.626497 -3.268092 0.5864
C  0.523802 -1.303236 0.325174
C  1.605467 -0.318051 0.140197
C  -1.611355 0.105032 -0.008484
C  0.633193 -2.681641 0.588884
C  1.56704 0.65119 -0.900116
C  2.748596 -0.375817 0.98325
C  -1.257502 1.295467 0.670414
C  -2.758678 0.05792 -0.835505
C  2.643131 1.543996 -1.082869
C  3.824426 0.517731 0.795354
C  -2.04473 2.452701 0.492369
C  -3.543349 1.219241 -0.996006
C  3.77505 1.4833 -0.236462
C  -3.18731 2.420819 -0.340331
H  1.533285 -3.274023 0.729207
H  0.705867 0.694488 -1.574459
H  2.781376 -1.112172 1.793849
H  -0.38705 1.314867 1.332419
H  -3.025359 -0.881535 -1.327301
H  2.601817 2.282219 -1.89093
H  4.696418 0.463749 1.456062
H  -1.770918 3.375158 1.015311
H  -4.432555 1.184607 -1.634341
H  4.609046 2.178455 -0.381069
H  -3.797726 3.320557 -0.471139
