program: Gaussian 09
title: 000281291
version: EM64L-G09RevD.01
frameworkgroup: C1[X(C17H13Cl)]
method: RPBEPBE
basis: SDD
operation: Freq
keyword: #p
keyword: freq=noraman
keyword: PBEPBE/SDD
title: #p freq=noraman PBEPBE/SDD
converged: YES YES NO NO
title: Mulliken charges:
elementType: Cl C C C C C C C C C C C C C C C C C H H H H H H H H H H H H H
charge: -0.075627 0.427940 -0.776611 0.178326 0.392359 0.573543 -0.389033 -0.381985 -0.460562 -0.249636 -0.431864 -0.400476 -0.354923 -0.263041 -0.245048 -0.227960 -0.224273 -0.237847 0.291215 0.265218 0.240954 0.240560 0.229733 0.239030 0.238229 0.253371 0.228340 0.230274 0.229732 0.228788 0.231275
chargesum: 0.00000
title: Mulliken charges with hydrogens summed into heavy atoms:
elementType: Cl C C C C C C C C C C C C C C C C C
charge: -0.075627 0.427940 -0.485396 0.178326 0.392359 0.573543 -0.123816 -0.141031 -0.220002 -0.019904 -0.192834 -0.162247 -0.101553 -0.034701 -0.014774 0.001772 0.004515 -0.006572
polarizability: 2.16030452e+02 3.61512904e+00 2.05677716e+02 1.44814480e+01 2.14209763e+01 1.45916289e+02
1716.lowfreq: -7.9956 -2.8746 -0.0023 -0.0020 -0.0016 8.7149 26.7303 36.5659 54.7599
frequency: 26.4928 36.4558 54.7381 95.2907 148.1292 153.7675 178.5913 208.8342 249.9687 277.5794 279.4988 400.6811 403.3689 418.5962 471.1464 483.7939 504.9728 514.8297 524.5355 589.2558 610.9540 619.9946 659.2089 672.9950 701.4105 734.8928 750.2967 781.7241 786.1609 789.3035 807.1932 822.8401 854.7196 869.8171 881.4735 931.5262 935.1746 960.7610 982.2442 987.9739 990.7139 993.7676 1000.3180 1014.8960 1025.9027 1036.2881 1079.7851 1087.8671 1150.4486 1173.4769 1176.3878 1180.2693 1187.7976 1194.9624 1201.8104 1235.1725 1243.5358 1263.7814 1288.5740 1332.4360 1368.8434 1387.3818 1405.3167 1418.8289 1438.0754 1443.2152 1455.8441 1481.0772 1516.3262 1590.0597 1592.9074 1600.8007 1610.2295 1632.2594 3057.1105 3118.8445 3122.6060 3126.0547 3129.1898 3134.1870 3141.3042 3147.8321 3150.6257 3152.4903 3165.3027 3166.2184 3166.6600
redmass: 5.7665 3.8502 4.9364 6.3237 4.4694 6.8448 4.1550 7.1745 4.2599 7.5046 4.8166 3.3763 3.2317 3.5287 3.2919 4.0412 5.6451 6.2304 4.2120 5.2291 4.8582 5.3288 4.1552 5.1394 1.6307 1.7520 2.4806 2.3950 2.8116 3.2402 1.9500 2.0310 1.2499 4.1653 1.9607 1.4189 1.4069 1.3987 1.4224 1.3438 5.4808 1.3747 1.3304 4.2657 2.2513 2.2528 1.9219 1.7802 1.4556 1.0668 1.1787 1.2770 1.1650 1.5691 1.1734 2.0520 1.7159 1.7186 1.8242 1.3273 2.2791 6.5679 2.8129 5.3322 2.5007 2.2223 2.4551 2.2655 3.7172 7.4833 6.1251 5.3176 6.0386 6.5239 1.0859 1.0874 1.0864 1.0869 1.0866 1.0883 1.0915 1.0928 1.0942 1.0959 1.0998 1.1006 1.0982
irintensity: 0.1806 0.0066 0.3721 0.7689 0.0347 1.0780 2.4604 2.5493 3.9943 4.7343 0.2011 3.1205 3.3365 2.1669 0.0962 1.0859 2.1423 3.3948 31.7579 8.6227 2.6130 16.4885 18.6161 45.9277 77.1152 6.5021 2.8093 11.5310 23.1469 13.1607 115.2594 3.3453 0.0931 4.5611 4.2610 0.2222 1.3490 2.1854 0.0566 1.3620 0.7083 1.6382 0.2300 2.5984 5.6793 5.5822 3.6625 13.2385 2.5467 0.4465 1.4800 7.5201 7.4692 9.4736 3.3125 4.2530 2.7757 21.2866 7.7338 3.9500 8.3824 0.4154 5.1683 2.1390 2.7884 11.5101 0.0836 7.2815 13.9473 0.1062 1.0181 6.3108 0.4353 1.2195 4.9755 5.2350 1.6345 3.7124 0.2599 4.8616 13.8074 18.6064 40.9291 24.8365 35.0586 22.5864 4.7427
temp: 298.150 k
press: 1.00000 atm
elementType: 17 6 6 6 6 6 6 6 6 6 6 6 6 6 6 6 6 6 1 1 1 1 1 1 1 1 1 1 1 1 1
symmnumber: 1
zpe: 638440.8 jmol-1
zpe.correction: 0.243169 hartree
zpe.thermalcorrener: 0.257511 hartree
zpe.thermalcorrenthalpy: 0.258455 hartree
zpe.thermalcorrgfe: 0.200245 hartree
zpe.sumelectzpe: -1114.455926 hartree
zpe.sumelectthermal: -1114.441585 hartree
zpe.sumelectthermalent: -1114.440640 hartree
zpe.sumelectthermalfe: -1114.498850 hartree
dipole: 0.7858 -2.4550 0.9536
dipole: 2.7484
quadrupole: -101.4393 -109.5426 -106.8428
quadrupole: 6.6627 2.4494 7.5577
quadrupole: 4.5023 -3.6011 -0.9012 6.6627 2.4494 7.5577
hfenergy: -1114.6990952 hartree
pointgroup: C01 [X(C17H13Cl1)]
dipole: -0.2569974 0.7696765 0.7147011 debye
polarizability: 211.9973026|8.6564621|212.9543509|-20.3087196|1.5205906|142.6728046 unknown
InChI: InChI=1S/C17H13Cl/c18-17(14-8-2-1-3-9-14)16-12-6-10-13-7-4-5-11-15(13)16/h1-12,17H
charge 0 multiplicity 1
31 atoms
Cl 1.615565 -2.034684 -2.277681
C  -0.433754 -0.970571 -0.577894
C  0.83887 -0.545306 -1.298472
C  -1.38536 0.059419 -0.207429
C  -2.603806 -0.326997 0.480682
C  1.928444 0.049856 -0.430034
C  -0.701273 -2.30298 -0.248281
C  -1.18223 1.454059 -0.487489
C  -2.835047 -1.706808 0.793399
C  -1.897956 -2.67504 0.438321
C  -3.560477 0.679493 0.840118
C  2.803025 1.022333 -0.981212
C  2.102162 -0.348264 0.919476
C  -2.132823 2.411618 -0.124874
C  -3.335864 2.024367 0.543213
C  3.832361 1.58821 -0.199611
C  3.132941 0.215676 1.701533
C  4.0008 1.184724 1.146003
H  0.604244 0.132388 -2.135392
H  0.012265 -3.07641 -0.546941
H  -0.260812 1.784246 -0.977193
H  -3.759699 -1.986106 1.312262
H  -2.073783 -3.730108 0.673814
H  -4.476693 0.370438 1.35752
H  2.681851 1.325161 -2.028895
H  1.425454 -1.091633 1.354212
H  -1.954987 3.469146 -0.349033
H  -4.073072 2.784892 0.822434
H  4.501079 2.338388 -0.635906
H  3.258615 -0.097103 2.744056
H  4.798966 1.622698 1.755697
