program: Gaussian 09
title: 000286412
version: EM64L-G09RevD.01
frameworkgroup: C1[X(C24H23ClFN5O4S)]
method: RPBEPBE
basis: SDD
operation: Freq
keyword: #p
keyword: freq=noraman
keyword: PBEPBE/SDD
title: #p freq=noraman PBEPBE/SDD
converged: YES YES NO NO
title: Mulliken charges:
elementType: Cl S F O O O O N N N N N C C C C C C C C C C C C C C C C C C C C C C C C H H H H H H H H H H H H H H H H H H H H H H H
charge: -0.024408 0.949059 -0.196625 -0.274306 -0.362379 -0.491369 -0.495308 -0.315519 -0.094134 -0.172322 -0.633946 -0.613734 0.187282 -0.685341 -0.703280 0.351594 0.231239 -0.024252 -0.313984 -0.377357 0.509369 -0.346453 -0.327153 -0.388572 0.393047 -0.073775 -0.358634 -0.382117 -0.214089 -0.238578 0.157535 0.271975 -0.288498 -0.326728 -0.204871 -0.189912 0.238244 0.211430 0.231807 0.243405 0.225956 0.204874 0.285621 0.262708 0.257388 0.335861 0.340243 0.235644 0.232952 0.320993 0.316734 0.241672 0.298727 0.291374 0.290767 0.263403 0.258402 0.238539 0.239797
chargesum: 0.00000
title: Mulliken charges with hydrogens summed into heavy atoms:
elementType: Cl S F O O O O N N N N N C C C C C C C C C C C C C C C C C C C C C C C C
charge: -0.024408 0.949059 -0.196625 -0.274306 -0.362379 -0.491369 -0.495308 -0.315519 -0.094134 -0.172322 0.042157 0.023993 0.187282 -0.003860 -0.029045 0.351594 0.231239 -0.024252 -0.028362 -0.114650 0.509369 -0.346453 -0.069765 0.080024 0.393047 -0.073775 -0.116962 -0.083390 0.077285 0.052189 0.157535 0.271975 -0.025095 -0.068326 0.033668 0.049886
polarizability: 6.50333180e+02 1.23970508e+01 3.21821185e+02 -3.24184051e+01 1.85944166e+01 2.39653100e+02
1716.lowfreq: -0.5038 -0.0024 -0.0017 -0.0010 3.0825 7.5104 11.0353 13.4523 19.6634
frequency: 9.7611 13.1582 19.6323 20.7751 27.6908 31.7533 41.5757 46.1338 52.7868 68.7609 69.6238 83.8298 90.6269 112.6067 118.7388 122.1451 140.5563 146.2697 156.0699 159.5611 177.9195 190.2934 206.5968 218.4198 229.7505 237.3987 241.4192 273.5847 283.6760 292.7049 300.3039 308.6173 313.9799 317.6564 341.2939 354.6225 374.0434 379.8523 382.4739 385.2779 387.5166 402.9860 405.5529 419.1556 433.7372 448.7379 452.3794 467.6776 488.2786 503.9941 510.0761 517.6324 519.1720 526.1691 529.2241 536.4978 549.7443 555.9825 575.3843 593.2200 617.3210 618.1193 634.4110 663.5305 670.7579 706.3680 713.3843 723.1477 724.8902 726.2219 736.5097 769.4577 800.2371 807.8728 813.8488 820.3687 823.2938 827.8809 841.7234 858.1824 858.6844 860.5612 887.7231 910.0741 944.7850 946.5160 947.2424 949.1544 959.3928 961.2879 982.9132 989.3279 990.3397 994.3052 996.4214 1020.5329 1023.5866 1034.9725 1049.7171 1049.9284 1085.7728 1105.3697 1119.6587 1119.8402 1129.7873 1144.9436 1162.0813 1174.7450 1187.8702 1191.7060 1209.4032 1215.8228 1217.4890 1218.6384 1249.2280 1250.1434 1259.8721 1289.0548 1297.1466 1335.5191 1351.8263 1365.0839 1373.0018 1387.3146 1392.2942 1397.5086 1403.9408 1408.2480 1432.3000 1445.7537 1449.3439 1453.9439 1460.6788 1461.3023 1470.0300 1473.1052 1478.1247 1485.9666 1532.7304 1552.2255 1562.8153 1569.6823 1592.8609 1593.9117 1599.2849 1603.6469 1610.9931 1617.5028 2943.5893 2979.9755 2997.7697 2998.3931 3079.6668 3094.5003 3101.0899 3110.7299 3130.9289 3144.9506 3154.5310 3158.8050 3160.7425 3168.9468 3172.3844 3174.3691 3174.7601 3182.3487 3184.6863 3554.4696 3568.0668 3709.1442 3730.3181
redmass: 7.0732 6.8937 6.3455 5.9272 6.4181 7.1580 4.9801 4.6525 6.3265 8.1350 6.7009 5.9857 6.3378 9.1436 4.7130 4.6164 4.9571 9.9984 8.5604 4.7641 6.2547 6.6341 4.4220 4.5295 1.6996 3.4060 4.0094 1.0375 5.0955 12.0594 3.4903 3.1673 4.4168 3.5489 4.0879 5.4666 1.4346 6.4137 1.7979 2.6148 2.4669 5.3738 3.3130 6.4219 4.8380 3.4688 6.6071 3.6027 2.9694 1.9996 3.2858 4.7282 1.5126 1.7089 6.7670 2.3022 5.1048 4.0647 5.6236 4.9204 5.3003 5.3970 5.7578 6.5136 8.1927 3.4222 4.9078 3.6530 11.0784 5.4866 4.9758 1.3781 3.2432 2.9652 1.9289 6.2666 1.5779 5.5294 6.1937 1.3063 1.4826 2.5969 1.5071 1.5769 1.6559 1.9086 1.6022 5.5962 1.4782 2.4614 1.3327 3.6090 1.6263 1.3880 6.9583 2.0526 1.7006 2.9192 3.3147 2.4588 2.3933 1.9276 2.2059 1.3582 2.0427 1.3250 1.1408 2.2224 1.1245 3.4175 2.4574 1.2023 1.6831 3.3644 3.8634 1.5947 2.0704 3.4379 1.2939 3.1229 2.5083 1.2249 7.8325 1.2943 5.0289 4.1107 4.2618 2.5781 2.3337 4.3216 1.0586 2.7624 1.0921 1.2511 1.0766 2.2922 1.0624 2.1841 2.5344 7.3001 6.2709 1.7164 6.7850 7.3792 5.9253 3.4801 3.5252 2.1827 1.0551 1.0349 1.1049 1.0358 1.1004 1.0996 1.1006 1.0992 1.0904 1.0861 1.0877 1.0907 1.0902 1.0929 1.0954 1.0965 1.0952 1.1003 1.0959 1.0444 1.0437 1.1052 1.1058
irintensity: 0.1398 0.0303 0.1930 0.1611 1.8747 1.4746 0.2957 0.3232 1.5527 0.2052 1.8892 1.0490 2.8738 0.6852 1.3593 1.1328 3.2785 9.6119 0.3491 0.6462 1.7619 3.0888 2.7955 0.5826 7.7469 14.7012 1.3201 0.5186 11.8752 5.1343 7.3309 6.9839 21.1506 4.1217 8.0262 12.6305 70.6340 1.1910 227.1162 50.6778 46.0808 12.6960 2.2415 62.5987 8.7415 13.9147 62.1870 8.4110 29.5339 31.2776 71.0343 3.0740 22.7247 7.5747 4.4561 30.0568 2.7663 7.4673 2.3611 22.4978 1.7819 1.9989 5.6207 2.4018 1.0193 2.2465 22.6791 8.9158 36.3936 44.3482 26.5012 79.8978 4.3360 65.0187 34.3845 107.3693 25.5432 15.8675 8.2367 17.3334 0.3974 2.3794 3.5350 1.0293 11.8189 11.6046 5.5163 51.8026 1.8236 11.8778 0.2163 47.1853 6.1079 0.9394 45.9071 4.3009 2.6411 86.3702 14.9154 37.2761 21.6032 6.7117 5.0925 6.8949 55.3811 25.6148 6.7370 6.5039 5.1693 29.9096 84.9121 53.6587 117.4926 13.2612 136.8746 5.4698 252.0450 2.4806 14.3598 9.5984 56.0051 34.7450 0.9069 33.0597 16.2521 161.8192 358.4297 28.2423 6.6998 148.1615 0.8543 42.1066 16.8620 214.0700 6.5772 3.8358 30.9455 260.8293 286.2555 21.5479 5.9848 183.7884 59.2379 0.8051 13.8861 347.8799 332.1406 486.7347 23.8502 15.8543 18.0576 19.6440 29.0161 13.6191 32.8391 32.8691 9.0489 2.1356 15.1228 9.8770 5.5862 1.6206 6.5799 4.2277 8.5726 18.8854 0.1877 57.4912 95.5507 59.6380 37.8770
temp: 298.150 k
press: 1.00000 atm
elementType: 17 16 9 8 8 8 8 7 7 7 7 7 6 6 6 6 6 6 6 6 6 6 6 6 6 6 6 6 6 6 6 6 6 6 6 6 1 1 1 1 1 1 1 1 1 1 1 1 1 1 1 1 1 1 1 1 1 1 1
symmnumber: 1
zpe: 1139949.8 jmol-1
zpe.correction: 0.434184 hartree
zpe.thermalcorrener: 0.469518 hartree
zpe.thermalcorrenthalpy: 0.470463 hartree
zpe.thermalcorrgfe: 0.362133 hartree
zpe.sumelectzpe: -2458.203586 hartree
zpe.sumelectthermal: -2458.168251 hartree
zpe.sumelectthermalent: -2458.167307 hartree
zpe.sumelectthermalfe: -2458.275637 hartree
dipole: -0.8258 -5.5079 1.1000
dipole: 5.6770
quadrupole: -222.9362 -220.2127 -223.7853
quadrupole: 18.4480 -4.3482 4.5876
quadrupole: -0.6248 2.0987 -1.4739 18.4480 -4.3482 4.5876
hfenergy: -2458.6377698 hartree
pointgroup: C01 [X(C24H23Cl1F1N5O4S1)]
dipole: -0.3642669 -0.4184309 -2.1635181 debye
polarizability: 651.0863715|29.1826313|239.4356228|6.8986344|-19.6321677|321.2854711 unknown
InChI: InChI=1S/C18H19ClN5O3S.C6H4FO/c1-18(2)23-16(20)22-17(21)24(18)12-5-8-15(14(19)9-12)27-10-11-3-6-13(7-4-11)28(25)26;7-5-3-1-2-4-6(5)8/h3-9H,10,20-21H2,1-2H3;1-4H
charge 0 multiplicity 1
59 atoms
Cl 2.296338 -1.285963 2.731206
S  -5.851495 0.487938 1.588036
F  -6.625699 0.347446 -1.932561
O  0.858604 0.079136 0.544841
O  -6.512128 -1.112572 0.466147
O  -5.858205 0.101115 3.164182
O  -6.684878 1.769687 1.033466
N  6.466481 -0.255412 -0.315684
N  8.692034 0.83698 -0.435469
N  8.339425 -1.459592 -1.232268
N  6.227266 -2.441992 -1.225041
N  10.325229 -0.315733 -1.661204
C  7.43736 0.77181 0.324888
C  7.728304 0.321756 1.784598
C  6.787311 2.168119 0.301466
C  5.04545 -0.163698 -0.121199
C  7.043246 -1.372895 -0.912479
C  9.079476 -0.268154 -1.060531
C  4.43916 -0.699696 1.0495
C  4.225135 0.458995 -1.092191
C  2.223504 0.034021 0.264638
C  3.052405 -0.595809 1.230509
C  2.831112 0.560074 -0.903962
C  -0.025392 0.723394 -0.429367
C  -1.449058 0.644026 0.091897
C  -4.079065 0.543192 0.980613
C  -2.494326 1.163265 -0.71536
C  -1.744751 0.072324 1.352319
C  -3.833318 1.114478 -0.279321
C  -3.080136 0.0135 1.810884
C  -7.720265 -0.88196 -0.140705
C  -7.80624 -0.171894 -1.376618
C  -8.932808 -1.387414 0.413782
C  -9.013033 0.01021 -2.063317
C  -10.154693 -1.220063 -0.264201
C  -10.196338 -0.521049 -1.498172
H  8.473366 1.005069 2.227347
H  6.81557 0.348654 2.407974
H  8.149647 -0.699466 1.794594
H  7.517127 2.882092 0.71683
H  6.568807 2.472686 -0.736068
H  5.862606 2.210652 0.902876
H  5.054086 -1.193819 1.8071
H  4.691448 0.865411 -1.994615
H  2.223656 1.049746 -1.67026
H  6.661031 -3.216274 -1.721228
H  5.25619 -2.48843 -0.929935
H  0.277851 1.782873 -0.566674
H  0.055999 0.207921 -1.409376
H  10.576442 -1.135678 -2.204571
H  10.943375 0.486381 -1.584774
H  -2.269881 1.603839 -1.694183
H  -0.930729 -0.324879 1.963448
H  -4.652169 1.502401 -0.891819
H  -3.334085 -0.417158 2.784389
H  -8.872802 -1.918746 1.369036
H  -9.022708 0.557622 -3.010222
H  -11.07661 -1.625152 0.164627
H  -11.149127 -0.384018 -2.019723
