program: Gaussian 09
title: 000280981
version: EM64L-G09RevD.01
frameworkgroup: C1[X(C13H27NO)]
method: RPBEPBE
basis: SDD
operation: Freq
keyword: #p
keyword: freq=noraman
keyword: PBEPBE/SDD
title: #p freq=noraman PBEPBE/SDD
converged: YES YES NO NO
title: Mulliken charges:
elementType: O N C C C C C C C C C C C C C H H H H H H H H H H H H H H H H H H H H H H H H H H H
charge: -0.288889 -0.414675 0.213026 0.312689 0.179128 -0.826429 -0.769970 -0.752783 -0.756471 -0.753419 -0.000881 -0.060182 -0.725222 -0.728389 -0.709423 0.203474 0.249979 0.220796 0.273277 0.204874 0.209382 0.212745 0.246179 0.193159 0.222997 0.213732 0.215548 0.216118 0.194637 0.278362 0.249103 0.321992 0.195060 0.249502 0.202076 0.210156 0.225164 0.227146 0.191928 0.220239 0.210208 0.224061
chargesum: 0.00000
title: Mulliken charges with hydrogens summed into heavy atoms:
elementType: O N C C C C C C C C C C C C C
charge: -0.288889 -0.092683 0.213026 0.312689 0.179128 -0.152180 -0.082437 -0.100700 -0.104195 -0.064302 0.248222 0.134879 -0.063488 -0.084151 -0.054916
polarizability: 1.74501396e+02 3.08539333e-02 1.41955773e+02 -3.48455258e+00 9.30181643e-01 1.36917554e+02
1716.lowfreq: -11.6342 -4.6631 -0.0008 -0.0008 -0.0004 10.6632 19.0349 47.0711 50.9321
frequency: 11.1415 46.3411 50.8966 67.8704 98.4365 126.6485 180.8822 190.5307 204.0047 205.3487 223.9172 230.5688 239.4546 241.8312 257.4794 262.4929 284.5376 297.9371 308.3306 329.1611 331.3867 343.2018 356.6360 360.8097 397.5044 411.6671 415.2553 443.8382 494.7231 496.1423 550.0276 568.4776 586.0746 669.3147 735.0903 762.5342 825.9871 869.2504 888.2274 909.4163 919.0711 926.7724 927.8717 939.2564 944.9330 952.7367 954.2347 994.3647 1016.7863 1022.2959 1027.4009 1033.7455 1093.1676 1138.1274 1146.4558 1154.8786 1168.2029 1171.4038 1201.1110 1213.7752 1229.8071 1232.9596 1247.1861 1289.5305 1312.0354 1335.7346 1354.8757 1368.7406 1374.9814 1375.4442 1380.0508 1380.8943 1390.6328 1393.9675 1405.8151 1453.5931 1457.9699 1459.5425 1464.5275 1465.4656 1469.0907 1471.1551 1473.1376 1476.7738 1480.2389 1481.8260 1485.4824 1487.0087 1495.5113 1497.2186 1499.6902 1506.6110 1579.7706 2966.3840 2967.8887 2971.2797 2974.3311 2974.5989 2976.2062 2979.3220 2981.1120 2986.3431 3018.1831 3053.4131 3054.9930 3058.9881 3062.7373 3067.8013 3069.7423 3070.9064 3071.7221 3073.9440 3075.8149 3076.9843 3079.6549 3083.0934 3090.8258 3097.2607 3114.0292 3567.0961
redmass: 3.0855 2.4564 4.6885 2.9924 2.9026 3.1844 3.3813 1.4818 1.3845 1.1291 1.0804 1.1563 1.0651 1.2054 1.2683 2.4484 1.6625 1.9764 2.1686 2.6061 2.2125 2.1146 2.2489 2.0697 2.3926 2.7826 2.3401 2.4902 2.9186 2.3972 2.2471 2.4851 1.6196 3.4953 5.1946 2.5393 2.6887 2.8490 2.0761 1.1888 1.8913 1.7345 1.5988 1.5128 1.7562 1.2391 1.4121 1.2705 1.5895 1.3895 1.4801 1.6588 2.4205 2.1764 2.1787 2.6669 2.4947 2.3674 1.9114 2.4990 2.4139 3.5674 2.6432 1.4831 1.5561 1.4055 1.3313 1.1986 1.1956 1.2144 1.1968 1.2094 1.2025 1.2139 1.2009 1.2409 1.0770 1.1107 1.0500 1.0673 1.0682 1.0733 1.0692 1.0750 1.0527 1.0934 1.0717 1.0537 1.0927 1.0882 1.0621 1.0600 5.9873 1.0415 1.0368 1.0360 1.0355 1.0367 1.0752 1.0366 1.0395 1.0372 1.0849 1.0992 1.0956 1.0988 1.0988 1.0984 1.0983 1.0995 1.0996 1.0993 1.0989 1.0985 1.0989 1.0965 1.0996 1.0996 1.0983 1.0761
irintensity: 1.1344 0.0705 4.5920 0.6633 0.3393 1.6142 3.5514 1.3992 0.9933 0.2494 0.2509 0.2970 0.0281 0.6028 0.0307 1.5099 0.5659 1.2390 7.5480 0.6903 5.0887 0.2605 0.9181 0.5656 0.2072 0.6684 2.0744 4.4050 2.0689 2.3949 15.4829 25.0294 38.8378 1.8438 1.5862 9.6712 4.0281 8.9539 0.1779 2.8031 3.7320 2.2777 1.4665 1.8678 10.8620 1.1630 0.8738 0.4756 2.0785 0.4545 5.0311 7.0317 30.7754 0.2547 41.7706 6.5785 19.3524 22.1004 12.1630 31.1303 3.5693 1.5579 1.5185 10.3754 28.6095 1.4821 1.6534 12.2152 6.1176 20.1249 28.3301 38.8368 43.8556 28.2900 25.5131 100.5307 11.9348 62.4832 1.1385 15.5517 11.6153 7.0174 6.6423 22.3076 15.0088 55.0155 42.2866 7.4589 60.6370 25.8153 9.3051 3.0086 115.5222 18.3566 13.0617 52.3987 32.7736 24.2389 19.1152 43.8281 29.1655 30.6627 5.7249 23.7403 45.5941 16.0484 4.9271 95.5274 23.0968 70.6305 22.5524 28.3585 61.5780 50.4528 56.1544 27.8676 22.5091 13.7813 11.1887 14.8853
temp: 298.150 k
press: 1.00000 atm
elementType: 8 7 6 6 6 6 6 6 6 6 6 6 6 6 6 1 1 1 1 1 1 1 1 1 1 1 1 1 1 1 1 1 1 1 1 1 1 1 1 1 1 1
symmnumber: 1
zpe: 990280.0 jmol-1
zpe.correction: 0.377178 hartree
zpe.thermalcorrener: 0.396815 hartree
zpe.thermalcorrenthalpy: 0.397759 hartree
zpe.thermalcorrgfe: 0.330033 hartree
zpe.sumelectzpe: -640.323938 hartree
zpe.sumelectthermal: -640.304300 hartree
zpe.sumelectthermalent: -640.303356 hartree
zpe.sumelectthermalfe: -640.371082 hartree
dipole: -1.4098 1.4202 3.0238
dipole: 3.6260
quadrupole: -89.7654 -98.9960 -100.3043
quadrupole: 0.3450 1.4733 -3.7345
quadrupole: 6.5899 -2.6408 -3.9491 0.3450 1.4733 -3.7345
hfenergy: -640.7011155 hartree
pointgroup: C01 [X(C13H27N1O1)]
dipole: -0.5732042 1.3059213 0.0331807 debye
polarizability: 174.5343812|-2.4106583|138.8546906|1.8916342|-2.9133246|139.9856514 unknown
InChI: InChI=1S/C13H27NO/c1-9(2)10(3)14-11(15)13(7,8)12(4,5)6/h9-10,14H,1-8H3
charge 0 multiplicity 1
42 atoms
O  0.222585 -1.987544 0.484901
N  -1.033741 -0.047306 0.460993
C  1.419007 0.119355 1.01716
C  2.392375 0.207746 -0.262636
C  0.161365 -0.722512 0.633533
C  1.036855 1.540844 1.519731
C  2.0992 -0.63172 2.198555
C  1.596562 0.654688 -1.522166
C  3.530408 1.238831 -0.016464
C  3.047104 -1.169164 -0.569601
C  -2.303037 -0.748076 0.160792
C  -3.195432 0.087666 -0.807723
C  -3.022541 -1.147948 1.472056
C  -3.573108 1.485939 -0.256314
C  -2.545153 0.207189 -2.206058
H  0.648016 2.200083 0.719576
H  1.923873 2.041952 1.942203
H  0.284474 1.483473 2.329244
H  2.224322 -1.699514 1.963058
H  3.085293 -0.192387 2.433911
H  1.472264 -0.559185 3.107257
H  2.29209 0.800696 -2.369694
H  0.856923 -0.108836 -1.822396
H  1.062944 1.611078 -1.364222
H  3.154841 2.277077 0.021358
H  4.080868 1.034221 0.920225
H  4.259085 1.179658 -0.846711
H  3.780028 -1.450215 0.208041
H  3.589037 -1.112578 -1.533014
H  2.288986 -1.967452 -0.631545
H  -2.008086 -1.68096 -0.355819
H  -1.068831 0.95858 0.625666
H  -4.135961 -0.492089 -0.914412
H  -2.367013 -1.804767 2.069416
H  -3.279965 -0.265554 2.085997
H  -3.95524 -1.700125 1.252284
H  -4.297747 1.978321 -0.930067
H  -4.033856 1.430098 0.746304
H  -2.692123 2.15637 -0.196874
H  -2.347061 -0.789948 -2.640718
H  -3.202611 0.759782 -2.902661
H  -1.580598 0.745435 -2.148865
