program: Gaussian 09
title: 000284815
version: EM64L-G09RevD.01
frameworkgroup: C1[X(C20H20N2O8S)]
method: RPBEPBE
basis: SDD
operation: Freq
keyword: #p
keyword: freq=noraman
keyword: PBEPBE/SDD
title: #p freq=noraman PBEPBE/SDD
converged: YES YES NO NO
title: Mulliken charges:
elementType: S O O O O O O O O N N C C C C C C C C C C C C C C C C C C C C H H H H H H H H H H H H H H H H H H H H
charge: 0.816356 -0.535820 -0.535853 -0.286919 -0.286973 -0.223804 -0.223788 -0.246144 -0.246156 -0.461619 -0.461617 -0.198555 -0.198348 0.367487 0.367278 -0.200405 -0.200445 -0.575473 -0.575462 0.538572 0.538574 -0.374606 -0.374560 0.164488 0.164533 0.229004 0.229008 -0.780849 -0.780852 -0.498883 -0.498891 0.310224 0.310229 0.267863 0.267893 0.319743 0.319749 0.309346 0.309347 0.261303 0.214585 0.262929 0.261320 0.214589 0.262916 0.232852 0.242659 0.253839 0.232850 0.242650 0.253836
chargesum: 0.00000
title: Mulliken charges with hydrogens summed into heavy atoms:
elementType: S O O O O O O O O N N C C C C C C C C C C C C C C C C C C C C
charge: 0.816356 -0.535820 -0.535853 -0.286919 -0.286973 -0.223804 -0.223788 -0.246144 -0.246156 -0.152273 -0.152269 -0.198555 -0.198348 0.367487 0.367278 0.109818 0.109785 -0.307610 -0.307569 0.538572 0.538574 -0.054863 -0.054811 0.164488 0.164533 0.229004 0.229008 -0.042032 -0.042028 0.230468 0.230446
polarizability: 4.76111969e+02 3.44238302e+01 2.95198960e+02 9.46031191e-03 -2.63962484e-03 1.88573484e+02
1716.lowfreq: -4.3645 -0.0015 -0.0014 -0.0007 2.1629 6.4806 12.3848 20.2427 26.4503
frequency: 12.1631 20.2248 26.4130 35.9959 50.1420 50.2491 53.8235 54.3799 63.8210 72.5924 82.1509 87.4123 88.1165 94.3464 94.9080 114.0610 114.8180 114.8565 131.8075 144.5347 148.1016 176.7655 184.0438 208.3877 215.2445 222.1114 231.0064 238.2745 254.5662 273.7340 274.7230 321.3291 325.0414 336.4487 337.8456 358.2452 359.6089 403.5223 405.2174 410.8106 435.1484 448.6227 488.6506 490.5202 494.6457 539.8782 556.8853 570.5982 574.7949 599.6835 601.1923 641.7123 643.4202 651.5195 651.7302 691.1100 694.3293 706.0739 707.3649 754.3798 755.6493 769.3146 770.9277 786.0207 855.0536 857.5680 882.5335 884.8216 911.8232 912.6686 914.6570 924.0085 925.2073 967.4935 967.5281 987.6761 991.2776 1000.2926 1000.4932 1013.3497 1013.6703 1040.6998 1040.7212 1073.2720 1077.4704 1115.1693 1115.1807 1147.7906 1148.4010 1152.0716 1153.8554 1205.3982 1205.5409 1238.2518 1240.3951 1259.3628 1259.9220 1301.1423 1301.3975 1360.6969 1361.5980 1390.4631 1390.4901 1399.7669 1400.0813 1424.5295 1424.6154 1449.2622 1449.2802 1451.2355 1451.2541 1463.8266 1463.9418 1466.1149 1467.8942 1471.6224 1472.6698 1505.3218 1506.3459 1585.4134 1585.8082 1602.4562 1602.8967 1628.5474 1630.9880 1631.2574 1635.0010 2997.6294 2997.6608 3007.0906 3007.1442 3099.2963 3099.3138 3100.3245 3100.4002 3110.6626 3110.6982 3147.8143 3147.8500 3151.6749 3151.7147 3157.7770 3158.3283 3199.8402 3199.8682 3535.7950 3535.8132
redmass: 5.5352 5.2174 5.7226 6.4143 3.3216 5.0075 1.6406 1.2954 4.0737 2.2649 2.2184 1.2527 1.4316 3.4117 5.9546 4.6360 3.8655 3.5337 8.1052 4.7685 5.6071 6.6719 6.4423 5.4955 5.8697 6.5631 6.7111 9.5944 10.2126 5.1295 5.0103 7.0667 5.8301 6.1490 6.5652 4.6700 4.6505 8.3103 5.8745 5.2773 3.6283 5.3061 4.8440 7.5387 4.9153 4.2379 4.1966 5.3060 4.0980 3.2437 3.2464 6.8360 7.0225 1.2839 1.2884 6.1200 5.7203 4.1592 4.1937 4.2358 4.1621 5.9506 6.0366 15.0748 5.2829 5.2475 1.3756 1.3530 2.6829 1.8352 3.6405 5.7208 6.7282 4.2371 4.2288 7.4746 6.8181 1.7084 1.6931 1.3351 1.3470 1.6389 1.6389 3.7069 3.5243 1.2637 1.2637 1.4032 1.4332 1.3979 1.4414 2.5575 2.5419 1.8415 1.8737 1.8662 1.7959 2.6566 2.6460 3.5083 3.5727 1.2300 1.2291 7.0690 7.0054 1.1914 1.1921 1.0448 1.0448 1.0494 1.0494 1.0521 1.0525 2.2049 1.6766 1.2664 1.5599 2.1973 2.2152 5.9958 6.0291 7.3367 7.1382 8.9385 4.7500 5.0602 10.0159 1.0361 1.0361 1.0295 1.0295 1.0981 1.0980 1.1006 1.1005 1.1046 1.1046 1.0916 1.0916 1.1050 1.1050 1.0907 1.0908 1.0949 1.0949 1.0766 1.0766
irintensity: 1.8093 2.7981 1.1692 0.6958 4.3442 10.9257 0.3859 0.1022 2.8409 0.2097 0.8511 0.1562 0.5415 0.5876 0.7957 5.4709 2.0643 3.8917 1.9482 2.4947 1.5110 6.0236 2.8683 0.7722 18.3377 1.9920 10.4893 0.0504 17.2175 0.7009 19.5272 14.0116 28.3364 16.6945 2.7503 1.2303 0.5786 61.6558 1.3747 6.4951 0.1315 8.0878 8.2156 47.0816 8.3646 7.1749 108.3090 69.0933 47.4509 2.0333 14.7796 2.3720 8.1798 24.4834 66.1521 0.1218 5.6916 4.4190 8.6671 10.0029 21.2181 12.8745 1.1520 70.9044 15.0743 2.8686 21.6245 36.5948 20.2113 46.3178 80.2729 7.8149 30.8571 2.9265 8.5644 28.0522 1.1582 0.3596 58.5179 1.3883 0.3845 7.8804 21.4624 325.7915 28.6603 0.2231 0.3768 3.4075 53.7428 51.8325 4.2084 4.0762 256.1328 278.7491 45.9837 134.8428 2.0826 0.0976 348.8985 393.2580 2.6155 92.5968 13.8389 6.2475 1.4458 2.8603 43.4497 11.0428 17.8732 8.9144 24.8399 24.7011 0.0986 239.2379 0.6575 106.1031 21.1255 963.1140 25.3800 98.1551 10.3096 180.1063 0.9342 1.9984 214.9473 37.6261 334.5539 12.8843 9.5166 56.0677 8.8676 5.8410 7.0322 16.8877 18.1628 8.1058 32.6572 11.7638 0.9301 24.6125 7.7979 20.5697 7.5842 18.8012 0.7579 16.9287 11.7096
temp: 298.150 k
press: 1.00000 atm
elementType: 16 8 8 8 8 8 8 8 8 7 7 6 6 6 6 6 6 6 6 6 6 6 6 6 6 6 6 6 6 6 6 1 1 1 1 1 1 1 1 1 1 1 1 1 1 1 1 1 1 1 1
symmnumber: 1
zpe: 980891.5 jmol-1
zpe.correction: 0.373602 hartree
zpe.thermalcorrener: 0.406167 hartree
zpe.thermalcorrenthalpy: 0.407111 hartree
zpe.thermalcorrgfe: 0.305471 hartree
zpe.sumelectzpe: -1881.093690 hartree
zpe.sumelectthermal: -1881.061125 hartree
zpe.sumelectthermalent: -1881.060180 hartree
zpe.sumelectthermalfe: -1881.161820 hartree
dipole: -0.0003 0.0011 -9.7731
dipole: 9.7731
quadrupole: -141.1428 -166.8802 -196.6063
quadrupole: -41.6454 -0.0092 0.0012
quadrupole: 27.0669 1.3296 -28.3966 -41.6454 -0.0092 0.0012
hfenergy: -1881.4672914 hartree
pointgroup: C01 [X(C20H20N2O8S1)]
dipole: 0.0000204 0.010299 3.8450217 debye
polarizability: 480.4690785|-19.4359671|290.8410365|0.0360801|-0.2884833|188.5742983 unknown
InChI: InChI=1S/C20H20N2O8S/c1-11(23)21-13-5-7-17(15(9-13)19(25)29-3)31(27,28)18-8-6-14(22-12(2)24)10-16(18)20(26)30-4/h5-10,21-22H,1-4H3
charge 0 multiplicity 1
51 atoms
S  0.000239 -0.004831 -1.886501
O  0.230858 -1.391943 -2.72248
O  -0.230415 1.37828 -2.729126
O  1.49683 3.655943 0.568276
O  -1.496268 -3.652408 0.58929
O  -0.331889 2.278125 0.155762
O  0.332383 -2.277766 0.166509
O  6.636959 -1.214874 0.08386
O  -6.636358 1.215393 0.077608
N  5.513446 0.755236 0.693853
N  -5.512895 -0.751395 0.698309
C  1.619589 0.241185 -0.868652
C  -1.619096 -0.245767 -0.867152
C  1.92782 1.408088 -0.130447
C  -1.927291 -1.408675 -0.122642
C  2.565722 -0.766746 -1.090467
C  -2.565246 0.760954 -1.094324
C  3.244085 1.536955 0.372277
C  -3.243517 -1.534796 0.380917
C  4.218152 0.530726 0.153798
C  -4.217617 -0.529818 0.156992
C  3.871946 -0.636187 -0.580176
C  -3.871455 0.633118 -0.583306
C  0.908151 2.448446 0.188207
C  -0.90766 -2.447398 0.20127
C  6.636328 -0.081003 0.643479
C  -6.635745 0.084606 0.643444
C  7.880511 0.484338 1.323542
C  -7.880015 -0.476981 1.326453
C  0.544657 4.74127 0.906697
C  -0.544005 -4.735863 0.933328
H  2.26903 -1.642084 -1.676988
H  -2.268561 1.633154 -1.685514
H  3.487271 2.440846 0.941023
H  -3.486613 -2.435552 0.954654
H  4.619925 -1.413953 -0.73991
H  -4.61944 1.410003 -0.747234
H  5.637581 1.647306 1.177381
H  -5.636993 -1.640781 1.186763
H  8.209777 -0.218745 2.107788
H  7.735285 1.480362 1.776554
H  8.694765 0.547441 0.581293
H  -8.210151 0.231046 2.105852
H  -7.734546 -1.469939 1.78606
H  -8.693781 -0.545412 0.584128
H  1.179188 5.599595 1.167226
H  -0.092223 4.440667 1.755649
H  -0.093269 4.966735 0.036271
H  -1.178448 -5.592701 1.19893
H  0.093228 -4.430584 1.78035
H  0.093571 -4.966208 0.063925
