program: Gaussian 09
title: 000279853
version: EM64L-G09RevD.01
frameworkgroup: C1[X(C11H11NO5)]
method: RPBEPBE
basis: SDD
operation: Freq
keyword: #p
keyword: freq=noraman
keyword: PBEPBE/SDD
title: #p freq=noraman PBEPBE/SDD
converged: YES YES NO NO
title: Mulliken charges:
elementType: O O O O O N C C C C C C C C C C C H H H H H H H H H H H
charge: -0.204727 -0.260401 -0.254970 -0.220782 -0.185453 0.016348 -0.201586 -0.115897 0.279720 0.115152 -0.691435 -0.386292 0.266260 -0.213799 -0.353666 0.312100 -0.751807 0.288222 0.273379 0.232341 0.256798 0.222948 0.288912 0.242413 0.290800 0.249010 0.255717 0.250696
chargesum: 0.00000
title: Mulliken charges with hydrogens summed into heavy atoms:
elementType: O O O O O N C C C C C C C C C C C
charge: -0.204727 -0.260401 -0.254970 -0.220782 -0.185453 0.016348 0.086636 0.157482 0.279720 0.115152 0.020652 -0.097380 0.266260 0.028614 -0.062866 0.312100 0.003616
polarizability: 1.88248732e+02 6.29066419e+00 1.55017029e+02 -1.06478352e+01 1.40041632e+01 9.67444659e+01
1716.lowfreq: -9.2854 -0.0006 -0.0004 -0.0003 0.5611 8.7752 33.4022 34.1348 41.2806
frequency: 33.3855 34.1211 41.2745 66.4551 76.1436 87.0155 132.4361 168.5241 181.7022 223.0935 228.1819 263.6185 278.7396 315.2713 358.5973 368.8241 418.5287 470.1489 478.2684 528.4253 548.6624 565.9167 575.2156 615.8415 627.6575 694.6984 704.6167 731.8692 766.4029 785.9025 808.3753 834.9183 848.8675 883.1066 935.0396 960.9572 963.9712 992.0719 993.7951 1019.6188 1042.6797 1060.5273 1108.6497 1113.7648 1143.9456 1168.8936 1192.8727 1206.5173 1212.6711 1218.8260 1264.6907 1285.7914 1298.9801 1330.2605 1358.8867 1385.4129 1394.0948 1404.4898 1444.9479 1451.4276 1454.0330 1457.5065 1462.6826 1475.3220 1593.0045 1615.1037 1645.4489 2994.1178 3008.1691 3065.3374 3078.1851 3095.7317 3098.9127 3110.9631 3143.8892 3156.1946 3171.9573 3185.2932
redmass: 1.9656 1.7363 8.3570 8.7842 3.6055 4.1975 4.2751 8.6865 5.6518 3.4117 1.2203 4.4486 3.6234 5.3257 5.8715 8.7833 4.0414 5.1130 3.9354 4.2775 4.2530 3.3994 5.9912 5.8932 5.6455 7.4020 7.2281 4.6681 6.3003 3.1877 1.8503 5.0092 4.0220 4.0795 3.2366 1.5111 3.3794 1.7168 1.3989 1.8895 1.6588 1.9470 1.5467 2.4919 3.7904 1.3555 2.6133 1.7834 2.1972 5.3446 2.0148 1.4507 1.4551 1.5528 7.9380 1.2389 1.2320 5.1073 2.8829 1.0618 1.0524 3.7953 1.0773 1.0480 7.6035 8.2675 9.4123 1.0365 1.0377 1.0869 1.0924 1.0955 1.0957 1.0995 1.1016 1.0879 1.0931 1.0982
irintensity: 1.7232 2.4262 0.1062 2.9617 2.9860 0.6511 3.7380 2.1470 3.9259 0.9488 1.2568 0.8894 0.6015 2.6337 3.6620 1.3599 4.5248 5.4487 6.4059 2.4474 3.6337 3.6057 3.9383 7.2682 13.9257 8.0256 15.7848 18.3780 12.4308 22.3978 48.6930 25.3843 13.5787 75.2630 19.2626 20.5642 126.7534 31.6579 14.7726 42.6840 9.2268 27.4522 11.5451 6.6554 57.0785 24.3522 317.7812 75.5742 175.0982 136.4463 21.9753 6.0814 0.5217 9.1563 66.3168 55.8639 16.6370 57.3343 62.8508 26.3403 21.5060 56.6050 6.4169 10.1440 41.0731 45.8748 158.0645 11.5454 1.0819 10.3650 0.9634 27.4558 6.9081 13.5546 7.9855 4.2362 2.8905 5.0498
temp: 298.150 k
press: 1.00000 atm
elementType: 8 8 8 8 8 7 6 6 6 6 6 6 6 6 6 6 6 1 1 1 1 1 1 1 1 1 1 1
symmnumber: 1
zpe: 541372.7 jmol-1
zpe.correction: 0.206198 hartree
zpe.thermalcorrener: 0.222060 hartree
zpe.thermalcorrenthalpy: 0.223004 hartree
zpe.thermalcorrgfe: 0.160944 hartree
zpe.sumelectzpe: -855.314156 hartree
zpe.sumelectthermal: -855.298294 hartree
zpe.sumelectthermalent: -855.297350 hartree
zpe.sumelectthermalfe: -855.359411 hartree
dipole: 5.9269 -0.2914 -1.2896
dipole: 6.0726
quadrupole: -116.4666 -89.3689 -96.4402
quadrupole: 9.3912 13.8130 -4.7716
quadrupole: -15.7080 11.3897 4.3184 9.3912 13.8130 -4.7716
hfenergy: -855.5203543 hartree
pointgroup: C01 [X(C11H11N1O5)]
dipole: 2.2654282 -0.623846 -0.4320525 debye
polarizability: 188.8625143|-1.7034906|157.8652767|-10.6615718|0.3443524|93.2824356 unknown
InChI: InChI=1S/C11H11NO5/c1-6-10(17-7(2)13)8-4-3-5-9(12(14)15)11(8)16-6/h3-6,10H,1-2H3
charge 0 multiplicity 1
28 atoms
O  -0.422807 1.669896 -0.127103
O  2.411196 0.129498 0.571298
O  3.293343 -1.82423 -0.347473
O  -4.382912 0.100876 0.711048
O  -3.043847 1.947378 0.610475
N  -3.238878 0.676071 0.50686
C  1.513807 0.260392 -0.636255
C  1.010851 1.722721 -0.647552
C  0.246946 -0.549222 -0.476978
C  -0.810116 0.339724 -0.137595
C  0.977191 2.37134 -2.031844
C  0.037442 -1.932196 -0.578084
C  -2.100147 -0.17968 0.136646
C  -1.260367 -2.446756 -0.315973
C  -2.30962 -1.580395 0.041034
C  3.266656 -0.983607 0.580268
C  4.09408 -1.006407 1.844399
H  2.110535 -0.015158 -1.521534
H  1.560747 2.332476 0.086484
H  0.431628 1.74166 -2.756696
H  0.475758 3.35139 -1.978151
H  2.00671 2.524928 -2.403801
H  0.868556 -2.592897 -0.84243
H  -1.447898 -3.52184 -0.38935
H  -3.315951 -1.954251 0.24945
H  4.914308 -1.730717 1.737135
H  3.457337 -1.306849 2.696074
H  4.493551 -0.004146 2.069145
