program: Gaussian 09
title: 000279076
version: EM64L-G09RevD.01
frameworkgroup: C1[X(C13H16O3)]
method: RPBEPBE
basis: SDD
operation: Freq
keyword: #pfreq=noraman
keyword: PBEPBE/SDD
title: #p freq=noraman PBEPBE/SDD
converged: YES YES NO NO
title: Mulliken charges:
elementType: O O O C C C C C C C C C C C C C H H H H H H H H H H H H H H H H
charge: -0.302782 -0.284851 -0.289264 -0.042003 -0.348376 -0.283753 0.205282 0.220067 -0.346039 0.564478 -0.549343 -0.421029 -0.330259 -0.165932 -0.533996 -0.742680 0.243356 0.223708 0.223241 0.239544 0.213437 0.247035 0.238181 0.225137 0.218077 0.213118 0.244831 0.222595 0.225886 0.225112 0.224989 0.222233
chargesum: 0.00000
title: Mulliken charges with hydrogens summed into heavy atoms:
elementType: O O O C C C C C C C C C C C C C
charge: -0.302782 -0.284851 -0.289264 0.201353 0.098573 0.169228 0.205282 0.220067 -0.099004 0.564478 -0.311162 -0.195891 -0.112183 0.047186 0.159317 -0.070346
polarizability: 2.66444314e+02 1.61411000e+01 1.50027058e+02 -8.38445911e+00 2.38196457e+00 8.79388829e+01
1716.lowfreq: -10.2451 -0.0008 -0.0004 -0.0002 2.0806 4.8557 11.2358 26.5183 53.4415
frequency: 4.2157 26.4884 53.4202 67.3650 79.1755 95.5547 119.3261 126.4603 173.7271 184.2704 191.2205 225.8691 232.4336 272.5802 286.4142 338.9124 360.1946 382.1380 399.9972 418.0601 469.6757 515.1605 543.9022 604.4156 616.6412 726.9125 729.6707 742.3337 777.2045 796.9464 800.8907 825.8095 871.2787 888.9001 891.1888 939.0530 948.5027 959.9875 972.0657 979.5148 1002.1556 1026.5494 1041.4596 1095.2063 1108.1701 1110.1434 1112.5769 1114.3152 1134.3417 1151.3823 1168.7211 1197.2215 1217.3263 1236.2126 1260.0759 1270.6892 1301.1215 1309.9106 1341.3436 1378.5215 1395.0874 1402.6614 1411.7516 1441.7557 1459.5745 1466.4528 1469.9674 1472.0923 1473.1592 1480.9259 1502.6095 1577.7869 1607.2083 1670.6229 2960.2303 2961.5002 2996.5001 3031.5187 3050.4625 3069.4834 3070.9536 3074.1224 3082.8771 3098.6848 3115.3528 3124.0868 3142.4374 3143.6314 3166.3471 3179.1689
redmass: 2.7086 5.3607 3.0881 3.7318 2.3408 3.3780 3.4246 2.9059 3.2341 1.2843 3.7980 3.6184 1.6404 4.5191 2.1825 4.2574 3.9305 3.0668 3.8134 3.0413 3.4008 5.3392 5.5566 3.6519 4.5376 4.6168 3.8653 5.1360 5.0620 4.2925 1.4615 1.5546 1.8166 1.4220 2.0437 3.6390 1.5205 2.1817 2.1179 1.1257 3.6664 1.3874 1.5311 1.3898 2.3424 1.4114 1.2592 2.3667 1.4289 1.3818 1.6851 1.3590 1.8344 1.4673 2.0990 1.6826 2.0616 1.3422 1.3569 3.5024 1.2880 2.4598 2.4909 1.2614 1.0476 1.0518 1.1637 1.0831 1.0919 1.1575 2.7154 7.3281 6.4114 5.6806 1.0366 1.0327 1.0619 1.0967 1.1041 1.0529 1.0952 1.0913 1.1005 1.0909 1.0931 1.0996 1.0878 1.0893 1.0965 1.1192
irintensity: 0.9337 0.1480 1.2233 2.3114 2.0182 10.6682 3.0927 0.7559 1.2666 1.4877 4.3058 4.1396 0.4639 11.6569 1.3528 2.9092 3.4512 0.9994 5.4331 8.5192 4.7777 1.6087 1.1975 3.5426 7.5659 0.2902 7.1216 15.2316 7.6399 34.1015 40.7547 14.0663 15.4947 22.6122 14.7411 59.6845 18.5702 19.8353 45.6031 60.3324 38.0401 0.3753 1.0694 4.0645 32.7430 18.6169 0.2526 91.3717 1.3799 8.4294 28.8548 4.9963 97.7001 0.4385 168.9303 86.9787 44.3328 0.6672 8.5592 18.9379 9.7895 5.4748 14.8738 8.7601 14.3238 12.7506 23.8270 1.0409 75.8661 7.6297 158.0627 28.2614 18.6285 4.2383 57.0613 61.1753 37.2678 26.4294 44.3385 26.6991 12.3956 15.4687 18.0509 52.2981 20.7124 22.6134 9.0238 12.5317 9.0388 32.3001
temp: 298.150 k
press: 1.00000 atm
elementType: 8 8 8 6 6 6 6 6 6 6 6 6 6 6 6 6 1 1 1 1 1 1 1 1 1 1 1 1 1 1 1 1
symmnumber: 1
zpe: 677770.2 jmol-1
zpe.correction: 0.258149 hartree
zpe.thermalcorrener: 0.275108 hartree
zpe.thermalcorrenthalpy: 0.276052 hartree
zpe.thermalcorrgfe: 0.209944 hartree
zpe.sumelectzpe: -729.353368 hartree
zpe.sumelectthermal: -729.336410 hartree
zpe.sumelectthermalent: -729.335466 hartree
zpe.sumelectthermalfe: -729.401573 hartree
dipole: -2.7043 1.3474 -0.4522
dipole: 3.0550
quadrupole: -96.8844 -79.0454 -99.6801
quadrupole: -3.0099 -8.4547 -0.5362
quadrupole: -5.0144 12.8246 -7.8101 -3.0099 -8.4547 -0.5362
hfenergy: -729.6115175 hartree
pointgroup: C01 [X(C13H16O3)]
dipole: 1.0622746 0.5618045 0.0245566 debye
polarizability: 266.279375|-17.4677486|145.5080306|-8.7205142|-15.6257764|92.6228494 unknown
InChI: InChI=1S/C13H16O3/c1-3-4-10-5-6-12(13(7-10)14-2)16-9-11-8-15-11/h3-7,11H,8-9H2,1-2H3
charge 0 multiplicity 1
32 atoms
O  -5.354208 -0.430486 -0.585273
O  -1.812102 -0.699273 0.638395
O  -0.875074 1.847351 -0.237465
C  -4.079293 -1.03185 -0.035327
C  -5.120783 -0.518103 0.907294
C  -2.83588 -0.221597 -0.327249
C  -0.455783 -0.44856 0.362396
C  0.063384 0.813089 -0.059557
C  0.446492 -1.50667 0.610479
C  2.364448 -0.10326 -0.007856
C  1.454469 0.964102 -0.250504
C  1.83305 -1.344465 0.43718
C  3.8059 0.138424 -0.224083
C  4.829409 -0.744941 -0.042431
C  -0.367724 3.161962 -0.636521
C  6.286324 -0.429846 -0.283166
H  -3.994195 -2.115583 -0.184227
H  -5.769777 -1.227763 1.433654
H  -4.957337 0.446375 1.403767
H  -3.020482 0.85674 -0.191186
H  -2.482442 -0.397931 -1.361926
H  0.024473 -2.459425 0.946161
H  1.858114 1.927611 -0.580291
H  2.497887 -2.189801 0.640209
H  4.065619 1.151039 -0.570518
H  4.610543 -1.76614 0.303329
H  -1.257486 3.805776 -0.698183
H  0.130703 3.119791 -1.62446
H  0.334303 3.565871 0.118371
H  6.884906 -0.571193 0.638654
H  6.721572 -1.103817 -1.047653
H  6.42607 0.610972 -0.625409
