program: Gaussian 09
title: 000280797
version: EM64L-G09RevD.01
frameworkgroup: C1[X(C13H20NO4P)]
method: RPBEPBE
basis: SDD
operation: Freq
keyword: #p
keyword: freq=noraman
keyword: PBEPBE/SDD
title: #p freq=noraman PBEPBE/SDD
converged: YES YES NO NO
title: Mulliken charges:
elementType: P O O O O N C C C C C C C C C C C C C H H H H H H H H H H H H H H H H H H H H
charge: 1.408606 -0.499557 -0.519901 -0.498510 -0.592609 -0.060477 0.331504 0.446633 -0.528270 0.124897 -0.362467 -0.385641 -0.219263 -0.812779 -0.795677 -0.231257 -0.258477 -0.650534 -0.647587 0.241312 0.277005 0.234763 0.229995 0.237166 0.224933 0.227317 0.293303 0.245027 0.239270 0.228074 0.228331 0.236023 0.228058 0.203540 0.251270 0.233953 0.214242 0.226760 0.251026
chargesum: 0.00000
title: Mulliken charges with hydrogens summed into heavy atoms:
elementType: P O O O O N C C C C C C C C C C C C C
charge: 1.408606 -0.499557 -0.519901 -0.498510 -0.592609 -0.060477 0.331504 0.446633 -0.286958 0.124897 -0.085462 -0.150878 0.010732 -0.123364 -0.018077 0.225147 0.205604 0.038229 0.044441
polarizability: 2.93802501e+02 -8.03116722e+00 1.65110635e+02 4.80015602e+00 1.76345612e+01 1.43084385e+02
1716.lowfreq: -24.6818 -7.6127 -6.1120 -1.8163 -0.0021 -0.0017 -0.0012 13.3509 17.2089
frequency: -24.4499 12.8985 16.2046 19.4537 27.3285 40.8535 46.4920 52.9556 69.2507 114.3385 131.8273 151.2309 153.6329 164.2324 183.1872 207.5072 220.0847 237.0949 250.4826 260.6013 289.8179 305.5419 330.7807 355.2040 368.3704 382.0415 405.1209 423.1366 459.0255 470.0426 474.4785 521.6531 572.6332 596.1730 623.9426 683.1410 695.2657 703.3817 764.3746 802.0787 802.4165 807.6407 813.5794 867.6508 883.6948 889.3549 896.5389 935.1649 975.7451 989.0680 994.9180 1000.2002 1007.4564 1017.4124 1038.8010 1049.1881 1066.9450 1091.9708 1092.8199 1100.0037 1104.7088 1139.8960 1145.0794 1184.1027 1214.7302 1262.1081 1273.5162 1308.5646 1324.7437 1355.2073 1357.3031 1380.2463 1383.9483 1390.1086 1392.6920 1399.1591 1417.4343 1452.7181 1454.8462 1461.5552 1464.3317 1470.4991 1472.3493 1473.9071 1479.0502 1481.9599 1485.8840 1486.6303 1556.3895 1598.9077 1614.5484 2976.2655 2987.6318 2990.5955 2993.9846 3008.8401 3017.0176 3057.9067 3073.0626 3074.2265 3080.7321 3085.5274 3086.8419 3087.6631 3111.3628 3112.7014 3122.5654 3131.9170 3140.6544 3146.3127 3170.0613
redmass: 1.0153 3.9022 3.2240 3.2247 3.2816 3.7928 3.5265 3.5863 3.4045 4.3059 5.1307 1.3368 2.0785 3.3473 2.7813 2.9634 2.4715 1.5728 2.3330 2.1059 3.7740 5.9991 4.5358 3.3476 5.8996 4.5917 4.7205 3.1063 3.9322 5.1751 3.3821 4.9779 6.3168 3.4022 6.2755 6.8911 6.7515 2.0359 6.9884 1.1435 1.1351 1.6737 4.0498 3.5730 4.1033 3.6207 1.3898 1.3868 2.0939 5.7394 1.4630 1.3607 2.6421 3.0680 1.5977 1.5634 12.5919 2.0429 2.1752 2.2399 1.5667 1.4918 1.5571 1.1085 2.1327 1.1350 1.1131 1.4686 3.0278 1.2265 1.2175 5.8271 1.3128 1.2412 1.2291 1.2372 2.7070 1.1313 1.0405 1.0548 1.0628 1.3736 1.0718 1.0768 1.0489 1.0544 1.7559 1.0703 5.0069 6.4079 5.9226 1.0385 1.0361 1.0363 1.0386 1.0577 1.0611 1.0953 1.1074 1.0969 1.1005 1.0998 1.0996 1.0972 1.1051 1.1033 1.0879 1.0976 1.0905 1.0928 1.0972
irintensity: 0.6562 1.0312 0.3592 1.5043 1.4195 1.0657 1.5996 2.4165 1.0599 2.8268 1.5615 2.1426 2.4133 1.7419 4.0083 2.8721 2.0867 0.3267 3.9779 10.9889 5.3459 10.6781 3.0424 1.3201 5.2579 66.4119 32.2389 2.6549 11.2471 36.5018 2.9904 1.1239 11.7298 0.0549 110.4301 174.9588 142.0727 26.3913 351.7019 17.9723 4.0281 67.2268 157.2080 95.3978 165.2796 13.7168 2.9519 4.0677 26.4999 0.5432 0.9620 0.7850 183.3223 100.4873 0.5619 16.0576 134.0183 5.4775 8.1614 14.2767 7.3517 7.1801 8.1714 0.2455 5.2718 1.0073 0.1079 11.7315 41.3879 10.2971 15.0949 4.4894 38.9549 22.8949 33.1094 14.0494 5.9656 8.5247 5.6007 7.5560 8.9928 13.8643 3.1463 14.3271 18.8769 10.6111 12.6395 9.1423 14.2013 1.2903 12.6555 36.7787 18.3381 17.8553 12.8521 29.3508 31.6065 21.5779 12.1311 9.6593 19.6072 16.7853 19.2894 26.7294 31.4777 40.0272 9.1832 7.4605 15.9672 15.9713 7.5784
temp: 298.150 k
press: 1.00000 atm
elementType: 15 8 8 8 8 7 6 6 6 6 6 6 6 6 6 6 6 6 6 1 1 1 1 1 1 1 1 1 1 1 1 1 1 1 1 1 1 1 1
symmnumber: 1
zpe: 815550.7 jmol-1
zpe.correction: 0.310627 hartree
zpe.thermalcorrener: 0.332771 hartree
zpe.thermalcorrenthalpy: 0.333716 hartree
zpe.thermalcorrgfe: 0.254466 hartree
zpe.sumelectzpe: -1202.736361 hartree
zpe.sumelectthermal: -1202.714216 hartree
zpe.sumelectthermalent: -1202.713272 hartree
zpe.sumelectthermalfe: -1202.792522 hartree
dipole: -2.2556 -0.6957 -4.0206
dipole: 4.6623
quadrupole: -93.3605 -113.0123 -126.4855
quadrupole: -1.7697 -5.4369 0.7222
quadrupole: 17.5923 -2.0595 -15.5328 -1.7697 -5.4369 0.7222
hfenergy: -1203.0469875 hartree
pointgroup: C01 [X(C13H20N1O4P1)]
dipole: -0.7701533 -0.7619953 1.4801378 debye
polarizability: 285.3831737|35.8156673|151.4488702|-2.2419051|17.5511117|165.1654772 unknown
InChI: InChI=1S/C13H20NO4P/c1-5-16-19(15,17-6-2)18-14-12(4)13-9-7-8-11(3)10-13/h7-10H,5-6H2,1-4H3
charge 0 multiplicity 1
39 atoms
P  2.7646 0.874573 -0.230354
O  2.988429 -0.750558 -0.711975
O  3.873531 1.148394 1.064505
O  1.348409 0.873906 0.828213
O  2.819384 1.901932 -1.431259
N  0.178185 0.319626 0.083034
C  -2.167559 -0.055645 0.133158
C  -4.587281 -0.573861 0.254976
C  -3.397883 -0.076839 0.843039
C  -0.932251 0.476126 0.783789
C  -2.138166 -0.541053 -1.205797
C  -4.532005 -1.050596 -1.078537
C  -3.314591 -1.033385 -1.799772
C  -5.885802 -0.613935 1.043112
C  -1.002429 1.130601 2.146571
C  2.830699 -1.881979 0.260008
C  4.896474 2.227905 0.894187
C  1.934939 -2.926723 -0.399971
C  6.079276 1.755807 0.046208
H  -3.44006 0.297305 1.87207
H  -1.197079 -0.510967 -1.762752
H  -5.444211 -1.430491 -1.554657
H  -3.289117 -1.396981 -2.832984
H  -6.022679 -1.596637 1.534979
H  -5.905138 0.155598 1.834627
H  -6.760461 -0.451687 0.388774
H  -0.020422 1.533449 2.431692
H  -1.743762 1.949292 2.1418
H  -1.31836 0.397814 2.912101
H  3.849443 -2.262419 0.450428
H  2.39827 -1.510089 1.207033
H  4.414334 3.11867 0.450687
H  5.192263 2.446515 1.933289
H  1.850007 -3.81685 0.251998
H  0.927507 -2.513573 -0.574449
H  2.359181 -3.243707 -1.367828
H  6.863752 2.535999 0.03416
H  6.516269 0.831787 0.462501
H  5.768802 1.568474 -0.996598
