program: Gaussian 09
title: 000018041
version: EM64L-G09RevD.01
frameworkgroup: C1[X(C21H31N2)]
method: RPBEPBE
basis: SDD
operation: Freq
keyword: #p
keyword: freq=noraman
keyword: PBEPBE/SDD
title: #p freq=noraman PBEPBE/SDD
converged: NO YES NO NO
title: Mulliken charges:
elementType: N N C C C C C C C C C C C C C C C C C C C C C H H H H H H H H H H H H H H H H H H H H H H H H H H H H H H H
charge: -0.118831 -0.270123 0.003112 -0.006545 -0.359911 -0.621370 -0.517891 -0.691181 -0.718226 -0.709712 -0.707436 0.401440 0.395147 -0.371616 -0.385452 -0.367234 -0.408793 -0.211977 -0.207358 -0.238403 -0.208067 -0.255071 -0.242175 0.239035 0.258779 0.307952 0.287178 0.260390 0.272014 0.278922 0.243758 0.249360 0.260515 0.249858 0.228310 0.255922 0.257857 0.249635 0.264114 0.245806 0.228575 0.258392 0.225777 0.260534 0.266592 0.271662 0.202786 0.245311 0.239895 0.243191 0.229394 0.242892 0.244762 0.248507
chargesum: 1.00000
title: Mulliken charges with hydrogens summed into heavy atoms:
elementType: N N C C C C C C C C C C C C C C C C C C C C C
charge: -0.118831 -0.270123 0.242147 0.252234 0.235219 0.189955 -0.024772 0.047503 0.045189 0.028783 0.037268 0.401440 0.395147 -0.105025 -0.113790 -0.164449 -0.163482 0.027918 0.035833 -0.009009 0.034825 -0.010309 0.006331
polarizability: 2.46394919e+02 1.36109112e+00 2.87166091e+02 -1.65217423e+01 -2.29285316e+00 1.86707045e+02
1716.lowfreq: -10.7660 -7.7986 0.0002 0.0003 0.0005 1.4152 16.1435 22.4606 30.9125
frequency: 15.6816 21.8622 30.5361 43.0112 68.5839 76.9572 88.5094 114.9156 119.9528 141.7803 179.7385 187.2310 210.9899 220.6403 221.8629 233.3152 246.8239 266.2792 285.4254 302.0413 316.7639 342.1261 359.0792 362.3409 370.2533 383.9416 402.0540 408.8068 412.5116 422.4753 445.2913 447.7851 459.7461 482.4429 514.8794 562.6988 591.0777 594.4362 613.6701 615.2107 671.4523 694.4250 701.1998 710.6267 734.5052 752.7117 776.5987 786.2465 814.9743 844.4637 850.2381 871.8974 883.0874 889.4107 895.9261 920.3969 926.9879 933.1948 940.4010 949.0378 964.3704 972.5640 977.7147 980.4215 986.8807 992.7626 1001.7629 1018.9279 1021.7684 1030.8421 1065.5400 1075.6697 1084.4804 1103.0318 1105.1648 1112.4343 1135.5568 1146.1406 1162.0717 1176.6117 1176.8575 1178.4130 1183.4608 1184.9355 1193.9123 1199.8427 1229.6570 1244.0183 1297.9591 1309.4032 1315.9468 1323.4298 1327.5630 1331.2204 1342.9557 1351.3005 1363.3515 1375.0156 1379.0389 1384.1117 1402.5473 1406.4426 1415.8098 1425.3767 1438.5583 1440.6444 1448.9513 1454.6863 1460.7319 1464.8960 1469.3934 1473.6015 1479.3973 1483.5993 1485.9749 1488.8975 1490.1366 1491.4257 1493.2613 1502.7612 1509.8006 1582.4207 1590.0744 1602.3536 1614.4064 3000.1356 3004.0671 3005.5481 3013.6401 3020.8973 3038.5511 3043.2973 3050.4792 3052.7936 3088.3927 3091.7177 3093.5792 3096.0342 3100.1296 3102.3092 3108.8723 3117.5154 3120.4282 3123.5863 3125.7017 3126.4447 3135.8986 3140.5759 3147.2910 3147.8533 3148.4100 3156.4037 3158.4327 3163.9942 3174.5578 3177.0588
redmass: 4.0174 3.4845 4.2632 3.9421 3.8005 3.0329 3.4862 2.1633 3.6650 3.2908 3.4386 1.3274 2.3678 1.2376 1.2863 1.8198 2.7931 1.4435 1.8250 3.0572 4.4685 1.5770 2.0950 2.6523 2.3277 2.6637 3.1338 2.8699 2.8655 2.6941 2.4468 2.8077 2.8525 3.3047 3.2209 2.6925 4.4051 3.3825 6.3743 6.3480 3.2123 1.9619 2.3564 3.3008 2.9078 1.8146 1.8721 1.4212 1.2543 1.4706 2.3419 2.5325 2.3866 1.4130 2.4164 1.4100 1.2293 1.2151 1.4396 1.4457 1.3576 2.5346 1.4058 5.2084 5.3890 1.3180 1.3447 3.8966 2.3763 2.4283 1.7095 1.9030 1.6649 1.8320 1.8401 1.7047 2.0433 1.8806 1.8284 1.3141 1.3392 1.0534 1.1296 1.9947 1.9030 1.1217 1.9010 2.5652 1.4490 1.2953 1.2599 1.3769 1.4469 1.3883 1.1823 1.7497 1.3103 5.0463 1.2830 6.2364 1.1991 1.1965 1.1792 1.1836 2.2534 1.1521 2.0970 1.1300 1.0501 1.0638 1.0556 1.0477 2.2482 1.0634 1.7973 1.1554 1.1212 1.0560 1.0606 1.0460 1.0487 6.0207 6.4507 6.0863 6.1103 1.0375 1.0389 1.0379 1.0382 1.0624 1.0337 1.0592 1.0858 1.0856 1.0986 1.0997 1.0983 1.0977 1.0973 1.1005 1.1001 1.1036 1.1002 1.0876 1.0998 1.0884 1.0870 1.0872 1.1009 1.0954 1.0919 1.0963 1.1044 1.0939 1.1013 1.1010
irintensity: 0.0557 0.0956 0.7527 1.3004 0.0617 0.4792 0.2239 0.2587 2.7087 2.6640 1.6315 0.2554 0.6149 0.0832 0.2984 2.2166 0.8850 0.0636 1.4443 2.2454 0.3463 0.5119 0.1839 1.8332 0.2393 2.5808 0.9919 1.9120 0.3291 4.3630 1.5265 5.2363 1.7016 7.2175 8.9118 17.4004 2.0867 9.1798 0.1284 0.4766 11.1903 41.9249 34.8522 18.2745 22.7321 105.6637 27.4263 34.8805 2.2996 3.4921 8.2204 7.7532 4.0643 2.6572 9.0083 2.0930 5.6113 1.0685 1.3020 2.7799 0.2654 8.9382 0.0271 1.2161 0.5022 0.4690 0.0504 3.0063 4.0589 15.2817 24.4534 22.5078 0.4402 7.4879 27.7609 19.0401 26.6309 9.0949 45.6724 2.3627 1.6291 0.2096 3.5442 6.6675 7.6741 7.4882 38.0201 68.3435 35.1923 2.3683 1.4725 14.4253 5.4133 6.4245 4.2117 46.7289 3.4852 7.7542 10.0620 6.4624 9.6015 37.1134 29.1402 47.6390 4.9154 28.7008 3.8751 2.1130 10.2148 6.6079 0.9757 4.1846 51.9295 10.4586 122.5424 130.0005 42.2055 7.4733 7.4679 16.9726 8.5569 16.5900 7.2762 79.9953 86.2236 6.9683 2.6308 5.6087 3.5268 32.3219 5.7948 6.3588 2.1690 4.5129 4.6422 5.5116 7.3731 21.9161 10.7063 13.2971 18.7741 15.2853 22.9668 14.3282 23.3113 7.3366 4.1435 1.5036 18.2564 15.2763 14.5202 17.7960 6.1929 14.0542 11.3997 6.8079
temp: 298.150 k
press: 1.00000 atm
elementType: 7 7 6 6 6 6 6 6 6 6 6 6 6 6 6 6 6 6 6 6 6 6 6 1 1 1 1 1 1 1 1 1 1 1 1 1 1 1 1 1 1 1 1 1 1 1 1 1 1 1 1 1 1 1
symmnumber: 1
zpe: 1248478.9 jmol-1
zpe.correction: 0.475520 hartree
zpe.thermalcorrener: 0.499244 hartree
zpe.thermalcorrenthalpy: 0.500188 hartree
zpe.thermalcorrgfe: 0.421720 hartree
zpe.sumelectzpe: -926.332042 hartree
zpe.sumelectthermal: -926.308318 hartree
zpe.sumelectthermalent: -926.307374 hartree
zpe.sumelectthermalfe: -926.385842 hartree
dipole: 10.8671 0.2767 0.4770
dipole: 10.8811
quadrupole: -85.6054 -113.7230 -124.8430
quadrupole: -6.1370 -3.5652 -2.6494
quadrupole: 22.4517 -5.6659 -16.7859 -6.1370 -3.5652 -2.6494
hfenergy: -926.8075624 hartree
pointgroup: C01 [X(C21H31N2)]
dipole: -4.2639404 -0.1860414 0.3325988 debye
polarizability: 241.6023743|-0.8881413|285.2318881|-23.8466442|12.4503842|193.433792 unknown
InChI: InChI=1S/C21H31N2/c1-18(2)23(5,19(3)4)17-16-22(20-12-8-6-9-13-20)21-14-10-7-11-15-21/h6-15,18-19H,16-17H2,1-5H3
charge 1 multiplicity 1
54 atoms
N  -2.726518 -0.553742 0.31251
N  1.122481 0.026503 0.415127
C  -3.317702 0.436577 1.408423
C  -3.634177 -0.402278 -1.003156
C  -1.259934 -0.2188 -0.061526
C  -2.787089 -1.996786 0.79254
C  -0.17972 -0.170076 1.062258
C  -2.944552 1.905443 1.121129
C  -2.979292 0.034257 2.857873
C  -5.025752 -1.045159 -0.826665
C  -2.956131 -0.951236 -2.273706
C  1.898121 -1.097668 -0.005711
C  1.477851 1.384881 0.063819
C  3.258191 -0.923725 -0.392829
C  1.755589 1.73714 -1.283867
C  1.361113 -2.418158 -0.005514
C  1.519369 2.387621 1.067059
C  4.040395 -2.029749 -0.776706
C  2.070253 3.072364 -1.617019
C  2.160317 -3.520505 -0.382808
C  1.816931 3.725569 0.72415
C  3.501812 -3.338606 -0.778914
C  2.094186 4.074182 -0.617866
H  -4.407896 0.323572 1.2797
H  -3.743522 0.691478 -1.102107
H  -0.95127 -0.988844 -0.785078
H  -1.273116 0.75503 -0.577849
H  -2.52908 -2.660018 -0.046691
H  -2.068533 -2.14658 1.608687
H  -3.798088 -2.231461 1.151533
H  -0.364388 0.674069 1.743168
H  -0.160319 -1.092089 1.668949
H  -3.534407 2.539773 1.805436
H  -1.881156 2.123946 1.311378
H  -3.190227 2.235713 0.09767
H  -3.469145 0.767499 3.522678
H  -1.902154 0.065517 3.082848
H  -3.373331 -0.95597 3.136767
H  -5.662211 -0.69388 -1.65743
H  -4.985701 -2.145467 -0.894606
H  -5.545443 -0.765801 0.105073
H  -3.680582 -0.853496 -3.101232
H  -2.707174 -2.024798 -2.197288
H  -2.055804 -0.393127 -2.571969
H  3.706875 0.073445 -0.372358
H  1.741121 0.96386 -2.059674
H  0.3263 -2.612152 0.297835
H  1.362131 2.115238 2.117568
H  5.085284 -1.86763 -1.062448
H  2.291986 3.331451 -2.657887
H  1.726515 -4.526655 -0.366278
H  1.858222 4.489007 1.508394
H  4.117163 -4.193924 -1.073394
H  2.337607 5.108743 -0.879992
