program: Gaussian 09
title: 000279341
version: EM64L-G09RevD.01
frameworkgroup: C1[X(C16H17NO6)]
method: RPBEPBE
basis: SDD
operation: Freq
keyword: #p
keyword: freq=noraman
keyword: PBEPBE/SDD
title: #p freq=noraman PBEPBE/SDD
converged: YES YES NO NO
title: Mulliken charges:
elementType: O O O O O O N C C C C C C C C C C C C C C C C H H H H H H H H H H H H H H H H H
charge: -0.288426 -0.279649 -0.233593 -0.433277 -0.191635 -0.201961 -0.285231 -0.087375 -0.148459 -0.096534 -0.080834 0.336431 -0.335422 -0.670961 -0.692387 0.084200 0.073153 0.177962 0.195909 -0.352028 -0.350802 -0.208767 -0.209089 0.279963 0.280729 0.263600 0.271262 0.194305 0.221887 0.223912 0.225911 0.242993 0.222982 0.222081 0.242933 0.358109 0.272017 0.271832 0.242217 0.242042
chargesum: 0.00000
title: Mulliken charges with hydrogens summed into heavy atoms:
elementType: O O O O O O N C C C C C C C C C C C C C C C C
charge: -0.288426 -0.279649 -0.233593 -0.075168 -0.191635 -0.201961 -0.285231 0.192588 0.132269 0.167066 0.190429 0.336431 0.080770 0.021855 -0.004391 0.084200 0.073153 0.177962 0.195909 -0.080012 -0.078971 0.033450 0.032953
polarizability: 2.66190845e+02 3.28813686e+00 1.37756383e+02 2.15120944e+00 1.16880391e+00 1.87122481e+02
1716.lowfreq: -11.4122 -3.1952 -0.0005 0.0007 0.0009 0.3859 16.5469 34.1447 42.4376
frequency: 16.4896 34.1184 42.3614 50.0219 83.8527 94.0374 123.9595 133.0807 142.8281 149.8540 168.0373 179.7850 201.6590 216.2282 231.7038 245.7303 290.5677 322.8466 334.3411 345.7595 378.0792 390.2615 412.0201 425.0532 454.4645 456.3664 459.7950 520.5985 523.0961 555.3486 570.9864 583.1993 629.3202 641.5978 658.9542 688.6024 705.8117 714.8738 721.8520 735.4143 788.4914 797.4007 803.8965 829.5640 855.8525 867.7984 909.3993 922.8741 932.7997 947.2357 962.3013 975.2097 976.9878 986.1819 991.3128 1008.8055 1011.3879 1018.7642 1033.7749 1048.0583 1056.1967 1071.8433 1091.5563 1112.3263 1138.8526 1169.8099 1172.3256 1184.2417 1204.4282 1205.0158 1220.8517 1238.4015 1246.1108 1266.2869 1285.1206 1291.3628 1303.1808 1306.0854 1317.0201 1340.5828 1346.5362 1368.0726 1379.1301 1386.3705 1393.0563 1417.7249 1447.0184 1454.0316 1454.3650 1454.8038 1456.2865 1467.2647 1477.3213 1614.8587 1617.2187 1625.7957 1675.4426 2954.8668 3001.3039 3006.0371 3008.5056 3033.8733 3071.6604 3076.1482 3088.5272 3099.8304 3110.7847 3116.0782 3122.7649 3142.1404 3155.2286 3166.4421 3176.3977 3544.9887
redmass: 4.6211 6.1541 5.9427 5.1742 4.1561 5.5917 5.1632 4.3514 5.4031 1.0410 4.1036 6.6682 1.2884 5.3336 2.2879 6.9652 4.8928 4.7670 5.8377 4.0595 3.2213 3.5662 3.2411 2.6557 4.8715 4.6745 1.2895 4.4861 7.1854 7.8025 3.8420 6.4571 8.5491 4.7030 4.8188 7.0642 4.2217 3.3300 6.1245 5.3373 5.2534 1.6646 3.4073 4.7869 5.1346 3.4864 1.3989 1.5158 3.6607 2.7690 6.2002 3.8048 1.4150 1.3493 4.3299 1.3508 2.6356 3.0081 3.2802 2.9396 6.0388 2.6857 4.4456 2.4089 1.8595 1.2032 1.9523 1.2315 2.2311 2.7664 1.5206 1.7015 1.3442 2.8103 1.4882 1.2021 1.2902 1.2510 1.2938 1.8676 2.4119 1.3630 1.2837 1.3378 1.2346 6.0845 1.0525 1.0657 2.4179 2.6036 1.1147 1.0599 1.0514 7.7429 8.2364 10.7452 12.4459 1.0686 1.0354 1.0844 1.0357 1.0842 1.0879 1.0952 1.0886 1.1001 1.0995 1.1000 1.1008 1.0866 1.0907 1.0957 1.1005 1.0657
irintensity: 0.4349 1.5577 0.8455 0.9621 1.5372 0.5930 1.3771 5.2226 1.0721 0.0317 4.2676 0.4220 0.5503 4.8049 1.5460 0.4007 7.3500 1.9121 8.3599 7.9040 5.7685 5.2712 4.2270 22.4454 1.9189 9.5628 114.9766 25.7629 7.9635 8.7083 1.9573 4.6811 44.4449 2.9221 0.2143 0.7644 4.9000 89.9672 10.7732 42.4217 0.1095 34.7069 18.7070 19.5398 8.8859 54.7133 0.0089 2.7446 127.0495 96.1264 36.5919 47.7781 3.2540 2.8193 69.6746 0.0597 81.2684 60.5176 72.2636 13.6070 46.7765 24.3829 36.3350 13.6320 55.9345 8.9505 5.3993 27.0619 21.7786 107.4843 25.3271 7.7748 5.3958 66.7069 0.4267 13.5691 2.2499 2.8178 13.6947 175.8614 192.0932 10.9309 39.7573 38.9965 28.9746 13.1031 1.3958 6.0413 9.6259 1.2503 3.4891 2.5494 13.6906 12.0686 123.1277 265.2929 65.4532 45.2030 10.0654 22.5467 13.3079 12.8663 12.7337 29.0474 23.4014 4.9960 24.7638 16.0807 20.4364 1.6007 4.4906 4.4727 19.8846 14.7248
temp: 298.150 k
press: 1.00000 atm
elementType: 8 8 8 8 8 8 7 6 6 6 6 6 6 6 6 6 6 6 6 6 6 6 6 1 1 1 1 1 1 1 1 1 1 1 1 1 1 1 1 1
symmnumber: 1
zpe: 810072.4 jmol-1
zpe.correction: 0.308540 hartree
zpe.thermalcorrener: 0.329227 hartree
zpe.thermalcorrenthalpy: 0.330171 hartree
zpe.thermalcorrgfe: 0.257926 hartree
zpe.sumelectzpe: -1124.311184 hartree
zpe.sumelectthermal: -1124.290498 hartree
zpe.sumelectthermalent: -1124.289554 hartree
zpe.sumelectthermalfe: -1124.361799 hartree
dipole: -4.0313 -2.6492 0.2191
dipole: 4.8288
quadrupole: -100.8765 -148.2801 -139.3102
quadrupole: -0.8365 6.1355 0.8167
quadrupole: 28.6124 -18.7912 -9.8213 -0.8365 6.1355 0.8167
hfenergy: -1124.6197244 hartree
pointgroup: C01 [X(C16H17N1O6)]
dipole: 1.6112623 -0.9315013 0.3813158 debye
polarizability: 266.1396859|1.4072974|145.7620396|3.6707355|18.3553914|179.1679833 unknown
InChI: InChI=1S/C16H17NO6/c1-16(2)22-12-11(10(7-18)21-15(12)23-16)17-13(19)8-5-3-4-6-9(8)14(17)20/h3-6,10-12,15,18H,7H2,1-2H3
charge 0 multiplicity 1
40 atoms
O  -2.583463 1.471654 0.13908
O  -2.264806 -1.807449 0.396932
O  -3.889762 -0.283953 1.16061
O  -1.790411 3.482461 -1.733231
O  1.276234 -1.01841 -2.227314
O  0.931669 0.870185 2.075341
N  0.756248 -0.057633 -0.110625
C  -0.692865 0.04665 -0.29675
C  -1.537172 -0.607581 0.838156
C  -2.648764 0.429295 1.196769
C  -1.188023 1.522367 -0.363802
C  -3.717081 -1.478691 0.275177
C  -1.25309 2.12316 -1.768954
C  -4.086119 -1.14289 -1.176167
C  -4.519353 -2.626007 0.877066
C  1.639869 -0.592155 -1.105689
C  1.464109 0.364493 1.053579
C  3.009843 -0.506801 -0.510612
C  2.905147 0.06856 0.779905
C  4.24931 -0.890959 -1.042875
C  4.036768 0.279174 1.58139
C  5.400851 -0.682892 -0.239263
C  5.296224 -0.106612 1.052183
H  -0.917282 -0.479314 -1.243563
H  -0.918548 -0.891514 1.702341
H  -2.56474 0.907142 2.185422
H  -0.585087 2.167843 0.304495
H  -1.864889 1.463611 -2.422105
H  -0.241438 2.213895 -2.19936
H  -3.852045 -2.001854 -1.828542
H  -5.165777 -0.92532 -1.246147
H  -3.535976 -0.254419 -1.524494
H  -5.594372 -2.378606 0.874008
H  -4.364229 -3.543689 0.284873
H  -4.193673 -2.807705 1.913311
H  -2.650812 3.4478 -1.239687
H  4.318175 -1.333927 -2.041193
H  3.944434 0.725161 2.57652
H  6.386364 -0.970343 -0.620479
H  6.202526 0.042577 1.648499
