program: Gaussian 09
title: 000281110
version: EM64L-G09RevD.01
frameworkgroup: C1[X(C20H22ClFN6O3S)]
method: RPBEPBE
basis: SDD
operation: Freq
keyword: #p
keyword: freq=noraman
keyword: PBEPBE/SDD
title: #p freq=noraman PBEPBE/SDD
converged: YES YES NO NO
title: Mulliken charges:
elementType: Cl S F O O O N N N N N N C C C C C C C C C C C C C C C C C C C C H H H H H H H H H H H H H H H H H H H H H H
charge: -0.055734 1.081197 -0.340566 -0.245971 -0.478261 -0.472733 -0.311782 -0.086015 -0.171510 -0.635278 -0.613222 -0.464697 0.180372 0.345629 -0.706371 -0.677330 0.233131 0.592833 -0.352244 -0.368984 -0.571126 -0.357672 -0.394668 -0.021796 -0.547731 0.216254 0.532703 -0.444342 -0.049218 -0.345078 -0.261162 -0.188515 0.267280 0.223128 0.187846 0.258733 0.205334 0.225518 0.288904 0.268443 0.251539 0.253140 0.256965 0.260512 0.239245 0.336111 0.339259 0.319414 0.320808 0.329232 0.286521 0.321565 0.290742 0.249649
chargesum: 0.00000
title: Mulliken charges with hydrogens summed into heavy atoms:
elementType: Cl S F O O O N N N N N N C C C C C C C C C C C C C C C C C C C C
charge: -0.055734 1.081197 -0.340566 -0.245971 -0.478261 -0.472733 -0.311782 -0.086015 -0.171510 0.040091 0.027000 -0.135465 0.180372 0.345629 -0.028116 0.012255 0.233131 0.592833 -0.063340 -0.100541 -0.066446 -0.357672 -0.137702 -0.021796 -0.047974 0.216254 0.532703 -0.157821 -0.049218 -0.023513 0.029580 0.061134
polarizability: 4.57430159e+02 -1.20006025e+01 3.95803995e+02 1.40747440e+01 -6.29115822e+00 2.47609207e+02
1716.lowfreq: -7.2394 -4.9871 -0.0009 0.0011 0.0014 5.8100 12.2487 17.6931 21.1229
frequency: 11.7551 17.5710 20.9319 23.8569 34.4951 38.2247 39.8665 51.8666 69.8644 73.5189 86.5190 103.3584 113.6782 122.5087 136.3034 181.8934 185.3385 190.5098 197.8350 200.9817 215.2674 219.8629 238.0302 240.5042 248.4877 265.6706 277.3694 289.0331 295.5765 305.2734 310.5691 319.3990 340.6744 348.5162 366.4105 373.2786 381.4285 401.3037 403.4213 423.7710 428.2869 445.2393 454.3494 460.0934 492.6551 498.3986 512.2261 517.8848 522.3410 526.3397 532.6091 544.2580 567.2942 596.9947 621.6745 629.4398 647.3774 654.9241 669.1627 674.6593 683.2444 684.1702 713.3685 722.0203 730.2927 789.7363 801.4056 807.4813 824.7700 842.6050 855.1578 859.6959 884.7143 887.9057 891.4387 913.7847 933.5279 934.8127 946.4529 950.3421 970.0241 973.6453 982.1552 990.8128 992.9517 1003.5705 1009.8656 1025.6944 1044.7691 1066.1242 1091.6285 1105.0727 1109.8198 1120.2243 1126.9345 1145.5902 1179.1293 1180.7179 1188.9460 1201.9180 1231.2555 1245.7348 1257.5305 1261.1676 1282.2611 1296.1197 1310.6850 1331.3065 1348.3200 1366.9856 1367.6209 1385.0379 1388.7363 1400.6844 1424.8114 1442.6221 1445.0309 1458.2808 1462.0973 1466.0868 1467.8913 1473.9005 1475.4903 1480.0863 1500.9292 1527.1805 1544.2476 1569.7351 1570.0735 1600.3422 1609.4230 1614.3558 1617.0926 1627.7723 2981.9436 2992.3454 3008.3782 3013.8297 3074.8851 3080.5073 3083.5945 3091.9064 3100.3564 3119.0403 3134.1501 3139.8575 3157.3812 3164.1454 3175.8513 3178.7217 3195.9305 3526.0732 3554.6803 3567.1897 3709.4806 3729.6155
redmass: 8.2047 8.2119 5.6422 7.4138 5.4183 6.2451 10.7692 9.1313 5.2937 7.9411 4.9260 8.3023 6.0114 4.2204 6.1265 5.9669 6.0827 5.6838 6.0325 6.5743 1.6411 7.9214 1.8863 8.8449 4.0017 1.0737 3.8861 6.9162 3.8686 2.8831 9.0623 2.9190 3.5715 3.2256 3.5241 1.2393 1.1982 6.1742 3.3817 8.6435 4.2219 3.6774 3.3948 3.6384 2.5184 2.4969 4.0010 4.7633 1.5486 2.5377 2.0606 2.5756 4.7384 4.3953 5.1624 5.2448 1.3048 5.4348 6.7191 8.5890 2.4068 5.9398 3.9775 8.1701 3.3316 3.4742 1.3192 4.9070 3.3801 1.9704 9.0442 2.6176 1.5294 3.1604 1.5709 1.5994 1.3531 2.8723 2.3182 3.0868 5.2551 1.4897 2.6698 1.4461 8.4046 2.3948 1.3366 2.6648 3.4547 2.2594 1.5606 1.9158 1.3781 2.2422 1.9878 1.4897 1.1494 1.1880 3.2065 2.0425 1.8376 3.4834 1.5710 1.7768 2.7133 1.4897 1.5719 1.4626 3.6370 3.7431 1.2288 1.2534 4.0934 4.2090 3.8945 4.1829 1.0656 1.0815 1.1668 1.0902 1.1481 1.0862 2.5469 2.6277 2.1564 2.7342 6.6504 1.9275 4.1629 4.5037 2.4318 2.4016 5.0802 4.9834 1.0350 1.0366 1.0611 1.0602 1.1017 1.1000 1.1035 1.0992 1.0999 1.0989 1.0893 1.0926 1.0887 1.0955 1.0936 1.0958 1.0962 1.0771 1.0444 1.0437 1.1052 1.1059
irintensity: 0.1869 0.0805 0.1718 0.0738 0.2235 0.0539 0.1983 11.4045 0.2394 2.9956 0.3789 1.0621 2.5992 1.0167 0.8148 2.8583 1.7588 6.5810 1.4018 3.9293 2.5410 1.1383 0.4318 8.2713 4.0219 1.0811 7.1029 50.2667 17.0454 5.5295 26.8620 4.4277 3.4956 14.3942 4.6883 19.7769 315.9936 13.3518 28.3406 52.6291 6.4206 28.3581 1.2192 7.1700 39.5852 3.2264 25.4687 3.0684 28.5041 57.2937 54.0675 5.8556 4.7811 14.5674 6.1671 0.7426 99.2059 1.2018 3.4078 8.7920 15.3220 21.0276 0.5686 37.7698 11.3943 7.6695 45.1569 66.8760 33.9043 3.6603 148.3422 8.7738 30.1200 19.7461 0.8558 3.7977 4.6109 3.0007 4.7437 44.0348 6.3650 1.6245 7.6282 1.2934 71.7873 5.0874 2.9057 22.2843 17.6353 3.5503 24.2060 4.5603 52.2235 3.2519 34.6294 21.4741 15.8306 6.4752 49.2085 0.8818 4.4667 9.5669 17.0385 11.5720 78.6111 22.3876 37.8607 16.4117 1.0931 74.1495 29.5503 29.4992 16.6595 373.7969 31.5091 84.3313 6.8642 3.6574 8.1723 34.2581 20.1760 44.5333 43.7507 109.2228 225.4584 334.3340 33.4523 246.6740 110.5895 451.4672 259.5137 886.6519 133.7843 97.8260 10.1607 17.1428 13.9196 21.2237 8.0627 19.8731 13.2129 37.5256 7.8020 11.2015 5.3908 6.2650 8.2786 2.4298 1.2986 8.4193 6.2774 12.3879 69.4090 139.9879 51.8424 39.0831
temp: 298.150 k
press: 1.00000 atm
elementType: 17 16 9 8 8 8 7 7 7 7 7 7 6 6 6 6 6 6 6 6 6 6 6 6 6 6 6 6 6 6 6 6 1 1 1 1 1 1 1 1 1 1 1 1 1 1 1 1 1 1 1 1 1 1
symmnumber: 1
zpe: 1058445.2 jmol-1
zpe.correction: 0.403140 hartree
zpe.thermalcorrener: 0.435382 hartree
zpe.thermalcorrenthalpy: 0.436327 hartree
zpe.thermalcorrgfe: 0.336270 hartree
zpe.sumelectzpe: -2285.005652 hartree
zpe.sumelectthermal: -2284.973410 hartree
zpe.sumelectthermalent: -2284.972466 hartree
zpe.sumelectthermalfe: -2285.072523 hartree
dipole: 0.0415 6.9622 -2.4912
dipole: 7.3946
quadrupole: -192.4393 -218.3251 -201.3520
quadrupole: -3.7193 1.5416 7.2190
quadrupole: 11.5995 -14.2863 2.6868 -3.7193 1.5416 7.2190
hfenergy: -2285.4087923 hartree
pointgroup: C01 [X(C20H22Cl1F1N6O3S1)]
dipole: -0.6765827 2.6652678 -0.9498763 debye
polarizability: 460.5623316|3.0851628|393.6924799|2.937338|-3.4073564|246.5885498 unknown
InChI: InChI=1S/C20H22ClFN6O3S/c1-20(2)27-18(23)26-19(24)28(20)14-8-6-12(16(21)11-14)7-9-17(29)25-13-4-3-5-15(10-13)32(22,30)31/h3-6,8,10-11,25H,7,9,23-24H2,1-2H3
charge 0 multiplicity 1
54 atoms
Cl 0.527528 4.003203 2.556364
S  -2.126392 -3.86597 1.185142
F  -0.560024 -3.931011 0.166584
O  -3.935403 2.655221 -0.924591
O  -1.658748 -3.458776 2.668799
O  -2.914945 -5.229118 0.870411
N  2.845203 0.286457 -0.321163
N  3.792741 -1.870038 0.457632
N  5.103508 -0.304756 -0.905936
N  4.25693 1.773038 -1.532085
N  6.093302 -2.156213 0.110525
N  -2.897179 1.266457 0.66145
C  2.553574 -1.198704 0.057702
C  1.820359 1.288564 -0.248708
C  1.574789 -1.239711 1.245981
C  1.938309 -1.899181 -1.18515
C  4.074144 0.548762 -0.919291
C  -0.251609 3.279116 -0.0520
C  1.687047 2.072576 0.928093
C  0.929905 1.517243 -1.331394
C  -1.391306 4.27727 0.055432
C  0.663405 3.032026 1.002317
C  -0.08075 2.495461 -1.225084
C  4.92122 -1.453494 -0.103046
C  -2.615832 3.708686 0.847443
C  -3.228048 2.514997 0.115765
C  -3.212147 -0.021385 0.16049
C  -2.624684 -1.138413 0.813466
C  -2.920913 -2.411804 0.3148
C  -4.071232 -0.235884 -0.955855
C  -3.7593 -2.675622 -0.778679
C  -4.336836 -1.546757 -1.40398
H  1.406799 -2.296789 1.505431
H  2.009223 -0.733065 2.124196
H  0.602395 -0.781214 0.991445
H  1.733782 -2.954472 -0.937422
H  0.982795 -1.426969 -1.479173
H  2.64397 -1.864108 -2.034328
H  2.378383 1.916553 1.760323
H  1.033213 0.923174 -2.24494
H  -1.054661 5.193981 0.571677
H  -1.737078 4.563413 -0.953464
H  -0.766808 2.660512 -2.064007
H  -3.389671 4.493835 0.904113
H  -2.307827 3.457412 1.878978
H  5.188552 1.968954 -1.889225
H  3.499389 2.438748 -1.654669
H  6.065792 -3.00707 0.664516
H  6.964237 -1.780821 -0.25172
H  -2.280315 1.288736 1.477435
H  -1.964581 -1.02037 1.680855
H  -4.512961 0.629226 -1.45322
H  -3.956152 -3.696814 -1.116194
H  -5.002794 -1.692985 -2.26014
