program: Gaussian 09
title: 000032911
version: EM64L-G09RevD.01
frameworkgroup: C1[X(C6H8Cl2N4)]
method: RPBEPBE
basis: SDD
operation: Freq
keyword: #p
keyword: freq=noraman
keyword: PBEPBE/SDD
title: #p freq=noraman PBEPBE/SDD
converged: NO YES NO NO
title: Mulliken charges:
elementType: Cl Cl N N N N C C C C C C H H H H H H H H
charge: 0.026234 0.028021 -0.327784 0.003972 0.015119 0.109243 -0.301103 -0.415305 -0.670305 0.127333 -0.247944 -0.257170 0.238114 0.239368 0.214866 0.213146 0.342846 0.216818 0.217047 0.227486
chargesum: 0.00000
title: Mulliken charges with hydrogens summed into heavy atoms:
elementType: Cl Cl N N N N C C C C C C
charge: 0.026234 0.028021 0.015062 0.003972 0.015119 0.109243 0.176378 0.012707 -0.008955 0.127333 -0.247944 -0.257170
polarizability: 1.62041984e+02 -2.59966030e+00 1.32041887e+02 -1.87076320e-01 -1.32109520e-02 5.73467742e+01
1716.lowfreq: 0.0024 0.0028 0.0033 2.2548 6.4561 8.1498 28.7417 69.9628 70.7169
frequency: 28.2643 69.7684 70.6738 127.4538 145.4490 166.9909 187.3484 219.2892 223.0480 237.7663 286.4997 374.1297 387.6213 430.1025 541.6914 580.8744 620.6011 639.5373 673.2146 751.9413 789.2257 790.1852 870.5660 885.2586 907.6144 934.8085 1054.2237 1091.3518 1117.9296 1151.3703 1160.8300 1186.9842 1244.1988 1279.9047 1289.8641 1301.7352 1346.2342 1368.4386 1399.9818 1446.3631 1476.1205 1480.5253 1480.8475 1483.9421 1496.8906 1586.0759 2974.1288 2983.7837 2993.4127 3018.9781 3049.9709 3080.0847 3087.6704 3546.4747
redmass: 2.6650 2.2699 4.2991 4.1748 9.2465 9.7907 14.6936 1.2107 3.8975 3.3586 5.9866 5.1304 14.4327 15.6140 5.1124 1.1966 10.0134 8.9209 8.8537 1.0862 11.6884 12.2927 12.6278 1.1596 1.8241 7.1280 3.3006 2.3197 4.6760 1.5734 4.0560 12.0901 1.2090 8.0665 1.0777 1.5400 2.1557 1.7741 1.2189 3.2902 1.0647 1.0510 1.3258 1.9620 1.1485 7.6834 1.0595 1.0365 1.0587 1.1014 1.1050 1.1011 1.0995 1.0772
irintensity: 0.4817 0.1083 0.1069 1.1422 0.0072 1.7162 0.5295 0.2419 1.8118 0.2115 6.1160 2.8551 2.5005 7.2038 14.0938 85.8831 1.6616 10.6965 9.9210 5.7082 14.8200 152.3881 1.5698 3.1191 5.9806 47.5206 3.1658 0.1649 93.2294 0.3911 64.6462 163.9850 0.1080 50.9701 0.1305 99.6440 261.3467 106.9879 8.2579 349.5000 2.3874 18.4034 113.0167 280.8938 1.0963 795.1890 21.8103 24.0411 31.1858 2.5533 20.9600 65.1620 39.3168 85.2119
temp: 298.150 k
press: 1.00000 atm
elementType: 17 17 7 7 7 7 6 6 6 6 6 6 1 1 1 1 1 1 1 1
symmnumber: 1
zpe: 377530.9 jmol-1
zpe.correction: 0.143794 hartree
zpe.thermalcorrener: 0.156058 hartree
zpe.thermalcorrenthalpy: 0.157002 hartree
zpe.thermalcorrgfe: 0.103117 hartree
zpe.sumelectzpe: -1371.659651 hartree
zpe.sumelectthermal: -1371.647387 hartree
zpe.sumelectthermalent: -1371.646443 hartree
zpe.sumelectthermalfe: -1371.700328 hartree
dipole: -5.9398 -1.4649 0.0119
dipole: 6.1177
quadrupole: -80.0607 -89.0865 -83.3957
quadrupole: 3.3217 -0.0073 -0.0282
quadrupole: 4.1202 -4.9055 0.7853 3.3217 -0.0073 -0.0282
hfenergy: -1371.8034454 hartree
pointgroup: C01 [X(C6H8Cl2N4)]
dipole: -2.3559243 -0.492746 0.003448 debye
dipolederiv: -0.1692569 -0.1828683 0.0008625 -0.2554335 -0.9029135 0.0037286 0.001046 0.0034775 -0.0653821 -0.5898124 0.4251045 -0.001336 0.4698328 -0.5174852 0.0014692 -0.0013156 0.0013386 -0.0643862 -1.7009584 -0.1499095 0.0017039 -0.4616012 -0.3211801 -0.0021279 -0.0069839 -0.0030687 -0.4281063 -1.7724298 0.093854 0.0007627 0.231377 -0.6117147 0.0017489 0.0008449 0.0017516 -0.1656234 -1.3141394 -0.392819 0.0024581 -0.7298527 -0.9294353 0.0037813 0.0051311 0.0035785 -0.1430202 -0.8255308 0.3186769 -0.0005577 0.2651164 -1.6905863 0.0063693 -0.0006601 0.007023 -0.0908658 0.6620377 -0.0994228 -0.0028712 -0.2933868 0.2152333 0.0024777 0.0035058 0.0039871 0.2971939 0.0245741 0.0439418 -0.000534 0.1117254 0.0880542 -0.002604 0.0011295 -0.0035578 0.1783938 -0.0515053 0.0266925 -0.0005523 -0.0193776 0.0391731 -0.0004525 -0.0008764 -0.0000516 0.0899264 2.2083879 0.2523156 -0.0022723 0.5909009 0.7787339 -0.0022191 -0.0043756 -0.0022742 0.2340759 1.4402323 0.1025711 -0.0018133 0.3506867 2.0391887 -0.0086758 -0.0029828 -0.0086892 0.068104 1.8224953 -0.3901205 0.000036 -0.4654732 1.6775696 -0.0063081 0.0005775 -0.0064176 0.0691887 -0.0280465 -0.0101567 -0.014106 0.073012 0.0030634 -0.0778112 0.0108676 -0.0912037 -0.0529858 -0.0226193 -0.0127218 0.0167312 0.0674109 0.0008816 0.0771992 -0.0082886 0.0895963 -0.0455074 0.0451105 0.0260021 0.0229024 -0.0169945 -0.0312221 -0.1151553 0.0060909 -0.1362815 -0.0776537 0.0442058 0.0255597 -0.0210413 -0.0183601 -0.0404943 0.1170829 -0.0055935 0.1390243 -0.0707594 0.2101674 0.0163457 0.0006312 0.1291817 0.191055 0.0010418 0.0019218 0.0019597 0.3099966 0.0916329 -0.0033007 -0.032758 0.0437512 -0.0031018 -0.1124861 0.0092122 -0.126809 -0.0797787 0.0914108 -0.0061615 0.034898 0.0424759 -0.0106869 0.115173 -0.0055431 0.1286003 -0.0711876 -0.165956 -0.083583 -0.0031437 -0.1149912 0.0258676 -0.0022319 -0.0037078 -0.0019838 0.1083774 unknown
polarizability: 161.8192039|-3.6609184|132.2639019|-0.0399937|-0.2838689|57.3475391 unknown
InChI: InChI=1S/C6H8Cl2N4/c1-2-3-9-6-11-4(7)10-5(8)12-6/h9H,2-3H2,1H3
charge 0 multiplicity 1
20 atoms
Cl 1.983313 3.02053 -0.010222
Cl 3.489125 -2.13768 0.010159
N  -1.349406 -0.765546 0.008905
N  0.91701 -1.36392 0.009495
N  0.228076 0.988101 0.000801
N  2.582352 0.397651 0.000302
C  -2.499075 0.161357 0.008276
C  -3.823591 -0.624827 -0.016248
C  -5.04238 0.321528 -0.010266
C  -0.053613 -0.368854 0.006443
C  1.542069 1.270665 -0.00258
C  2.174864 -0.9022 0.006584
H  -2.446358 0.809364 0.904202
H  -2.425364 0.831059 -0.869557
H  -3.854359 -1.267047 -0.919327
H  -3.86986 -1.297072 0.864245
H  -1.50922 -1.775899 0.015696
H  -5.047708 0.958576 0.893527
H  -5.03436 0.9872 -0.893142
H  -5.986914 -0.249986 -0.026494
