program: Gaussian 09
title: 000032883
version: EM64L-G09RevD.01
frameworkgroup: C1[X(C8H9Cl)]
method: RPBEPBE
basis: SDD
operation: Freq
keyword: #pfreq=noraman
keyword: PBEPBE/SDD
title: #p freq=noraman PBEPBE/SDD
converged: NO YES NO NO
title: Mulliken charges:
elementType: Cl C C C C C C C C H H H H H H H H H
charge: -0.073540 0.509741 0.460199 -0.256325 -0.390713 -0.378287 -0.397847 -0.792565 -0.802080 0.232233 0.256620 0.232407 0.244570 0.244710 0.220200 0.227370 0.237948 0.225358
chargesum: 0.00000
title: Mulliken charges with hydrogens summed into heavy atoms:
elementType: Cl C C C C C C C C
charge: -0.073540 0.509741 0.460199 -0.256325 -0.158480 -0.121668 -0.165439 -0.083084 -0.111404
polarizability: 1.27525018e+02 -9.92362822e-01 1.02661908e+02 -3.20113028e-01 -1.89030560e-01 4.73455825e+01
1716.lowfreq: -5.2131 -0.0035 -0.0017 -0.0007 4.4935 14.3313 39.0563 122.3753 133.3525
frequency: 38.8080 122.3413 133.3463 171.8747 213.6302 271.9038 307.7513 382.6649 437.4675 446.3001 458.9776 549.5468 674.2534 702.4937 732.4081 821.2064 859.2708 878.1198 956.1646 982.3678 1007.6182 1031.3469 1045.1637 1049.3682 1153.3877 1211.2079 1233.7280 1277.2872 1357.1198 1392.3104 1398.5160 1401.9514 1460.5262 1464.7467 1472.5766 1478.1719 1493.0039 1568.4481 1620.9763 2975.8854 2983.2564 3057.4703 3062.0968 3087.0372 3093.6912 3120.8951 3143.9656 3150.1385
redmass: 1.0192 1.5028 1.5652 4.6675 5.4584 2.9213 3.3794 5.7251 2.9598 3.3071 4.9480 3.6086 7.1544 3.1777 4.2063 1.2588 5.3739 1.3398 1.3362 1.5050 1.4081 2.7331 1.5493 1.5382 1.3086 1.6236 6.6204 1.3951 4.4392 3.1800 1.2241 1.2912 1.0449 1.1138 1.0536 1.0922 3.1372 5.2237 7.2892 1.0387 1.0367 1.0950 1.0972 1.0999 1.0998 1.0873 1.0959 1.0934
irintensity: 0.5599 2.0701 0.4281 1.5242 0.5086 2.9012 0.2079 2.4633 8.4275 2.1255 2.1212 6.4179 11.2272 2.4408 5.1983 38.2442 23.7544 6.2255 0.2286 18.3537 2.5999 25.9024 1.7130 23.9629 3.4564 3.3784 8.2899 0.1685 3.4054 9.2184 10.0703 9.2697 13.4039 3.1617 13.8491 34.8510 42.8532 18.7736 11.5038 33.4259 23.2116 21.8439 15.6620 17.8440 18.0372 11.1431 24.6261 2.4405
temp: 298.150 k
press: 1.00000 atm
elementType: 17 6 6 6 6 6 6 6 6 1 1 1 1 1 1 1 1 1
symmnumber: 1
zpe: 376421.7 jmol-1
zpe.correction: 0.143371 hartree
zpe.thermalcorrener: 0.152626 hartree
zpe.thermalcorrenthalpy: 0.153570 hartree
zpe.thermalcorrgfe: 0.108263 hartree
zpe.sumelectzpe: -769.658918 hartree
zpe.sumelectthermal: -769.649663 hartree
zpe.sumelectthermalent: -769.648719 hartree
zpe.sumelectthermalfe: -769.694027 hartree
dipole: -1.7060 1.1887 0.0622
dipole: 2.0802
quadrupole: -55.9064 -56.2062 -63.7356
quadrupole: 3.8358 -0.1457 -0.0351
quadrupole: 2.7096 2.4099 -5.1195 3.8358 -0.1457 -0.0351
hfenergy: -769.8022895 hartree
pointgroup: C01 [X(C8H9Cl1)]
dipole: -0.5793919 0.5775147 0.0241066 debye
dipolederiv: -0.4845465 0.3209603 -0.0015117 0.363132 -0.4935533 0.0006118 -0.0007462 -0.0018642 -0.0848386 0.155395 0.2298609 0.0040334 0.1747983 -0.2417543 0.0004843 0.0029457 -0.0002443 0.0030347 0.3654905 0.1076347 -0.0160703 0.064965 0.0480636 -0.0049333 -0.0821122 -0.0207688 -0.035004 0.5638099 -0.4980798 0.0007873 -0.5940668 0.6870306 0.0038695 0.00445 0.0055851 -0.0845466 -0.0181102 -0.1017121 0.0008438 0.0614974 0.0993096 -0.00483 0.0073227 -0.0006972 -0.1646969 -0.3335893 0.0586838 -0.0010353 0.1560035 -0.0958054 -0.0069897 0.0082952 -0.0049973 -0.1257091 -0.1208144 -0.0657301 -0.0015789 -0.1757835 0.0016595 0.0058581 0.0059567 0.0060564 -0.1703749 -0.1656346 -0.0270922 -0.0003792 0.0260869 0.122549 0.0000656 -0.0019403 -0.0008523 0.0590149 -0.1188928 -0.0552273 0.0105782 -0.0517289 0.0449982 0.0021318 0.1065732 0.0273412 0.0663769 0.0493393 -0.0630764 -0.0012407 -0.0486876 -0.1081112 0.0004509 -0.0033315 0.0010149 0.152157 0.0805816 -0.0448745 -0.003487 -0.0490409 -0.0438545 0.0001848 -0.005237 -0.0044927 0.1569531 -0.040319 0.110762 -0.0036813 0.1019172 -0.0033266 -0.0016022 -0.0074845 0.0025747 0.1556207 -0.0052986 -0.0113005 -0.0637538 0.0177568 0.0721868 0.0855855 -0.104886 0.0426749 -0.0321955 -0.0066446 -0.0108274 0.0643405 0.0186004 0.0729371 -0.0845151 0.1055521 -0.0421596 -0.0311381 0.0808848 0.0355313 -0.0001367 -0.0751323 -0.1542522 -0.0009539 -0.0004763 -0.0002451 0.1093948 0.0472408 0.0033286 0.0051137 -0.0734977 -0.0784995 -0.1077009 -0.0550436 -0.0994677 0.0543802 -0.0243358 -0.0353081 0.0522182 -0.0410467 0.1017629 0.0268406 0.1050688 0.0369274 -0.0982521 -0.024556 0.0464669 -0.0450401 0.1242268 -0.0313406 0.0854423 -0.0849069 0.0536145 0.0698235 unknown
polarizability: 126.4294089|-5.1998245|103.7584098|-0.253004|-0.101568|47.3446896 unknown
InChI: InChI=1S/C8H9Cl/c1-6-3-4-7(2)8(9)5-6/h3-5H,1-2H3
charge 0 multiplicity 1
18 atoms
Cl 2.013962 -2.021254 -0.003297
C  1.149838 0.650129 0.001753
C  -1.638733 -0.125997 -0.016759
C  0.737194 -0.704675 -0.003556
C  0.105463 1.611359 -0.004945
C  -0.611315 -1.103752 -0.014512
C  -1.25635 1.23915 -0.015653
C  2.608053 1.060431 0.009434
C  -3.100084 -0.540362 0.005724
H  0.378196 2.673514 -0.00609
H  -0.862352 -2.169705 -0.022148
H  -2.029877 2.01611 -0.025219
H  3.132791 0.660864 0.896918
H  3.141109 0.664627 -0.874757
H  2.704891 2.159094 0.012211
H  -3.26158 -1.489104 -0.535701
H  -3.454637 -0.690399 1.044193
H  -3.743768 0.230671 -0.452798
