program: Gaussian 09
title: 000032878
version: EM64L-G09RevD.01
frameworkgroup: C1[X(C8H10O3S)]
method: RPBEPBE
basis: SDD
operation: Freq
keyword: #p
keyword: freq=noraman
keyword: PBEPBE/SDD
title: #p freq=noraman PBEPBE/SDD
converged: YES YES NO NO
title: Mulliken charges:
elementType: S O O O C C C C C C C C H H H H H H H H H H
charge: 0.941493 -0.571532 -0.501514 -0.499065 -0.342928 0.505997 0.459545 -0.416550 -0.411743 -0.205204 -0.798445 -0.778649 0.246989 0.246197 0.278159 0.219594 0.269513 0.264161 0.261541 0.217499 0.237354 0.377587
chargesum: 0.00000
title: Mulliken charges with hydrogens summed into heavy atoms:
elementType: S O O O C C C C C C C C
charge: 0.941493 -0.193945 -0.501514 -0.499065 -0.342928 0.505997 0.459545 -0.169561 -0.165546 0.032150 -0.031179 -0.035448
polarizability: 1.48854827e+02 9.35053232e-02 1.36557521e+02 7.15644982e-01 5.23788608e-01 7.42628445e+01
1716.lowfreq: -3.9276 -0.0024 -0.0017 0.0018 8.3869 9.2565 42.2846 77.3761 138.2323
frequency: 42.2221 77.3679 138.2256 155.5707 178.9340 186.7157 204.2261 218.7229 230.2187 249.4415 279.2004 315.4060 325.9629 335.8502 426.9095 463.1156 497.4091 518.0540 524.3632 532.3964 559.7769 712.8416 742.7201 788.9408 833.9997 899.0521 912.8745 954.7021 965.6062 991.8904 1002.4094 1041.4590 1048.3545 1050.5423 1056.0499 1113.1383 1180.2122 1258.7041 1262.7432 1350.8349 1389.3084 1405.5747 1409.3856 1454.4571 1459.9003 1463.7291 1470.2000 1484.1915 1572.5361 1598.4941 2998.7175 3002.2174 3087.7755 3088.9395 3101.9918 3104.3120 3134.3769 3146.3481 3165.6454 3479.2071
redmass: 6.2300 4.1809 1.3344 3.9869 1.9992 1.2148 2.4490 2.3953 7.8717 2.4205 4.2328 4.4364 3.3542 7.4641 8.5860 2.9470 4.9698 5.7188 3.0702 5.9275 7.0525 3.5717 6.2062 1.2061 12.9848 1.3049 3.0328 16.6537 3.9893 1.3588 1.7725 1.1800 1.5458 1.6372 1.5540 1.6022 1.1829 1.6781 3.4700 5.5338 2.3933 1.2288 1.2527 1.7816 1.2191 1.0472 1.1334 1.1109 4.8443 7.6817 1.0363 1.0368 1.0973 1.0968 1.1012 1.1005 1.0862 1.0921 1.0999 1.0661
irintensity: 0.2235 0.3622 5.0241 15.9822 3.7961 4.5588 8.5346 0.4445 8.0566 41.7970 8.0929 31.2664 10.2101 13.5030 66.8386 2.6859 46.0935 1.1643 0.5664 30.0718 83.4616 0.9459 1.8841 56.3868 53.1350 0.0041 0.3341 103.4534 3.7563 0.0364 1.4926 62.9328 12.0536 7.0355 11.0841 4.9625 1.6505 3.9699 3.1151 11.9984 5.2646 30.1159 13.3430 3.4264 22.5323 16.3339 37.4778 28.6539 0.1973 16.6780 14.8540 11.2325 1.5378 5.5536 22.2216 14.0038 0.2350 15.3079 20.9950 39.1420
temp: 298.150 k
press: 1.00000 atm
elementType: 16 8 8 8 6 6 6 6 6 6 6 6 1 1 1 1 1 1 1 1 1 1
symmnumber: 1
zpe: 428529.1 jmol-1
zpe.correction: 0.163218 hartree
zpe.thermalcorrener: 0.176300 hartree
zpe.thermalcorrenthalpy: 0.177244 hartree
zpe.thermalcorrgfe: 0.124222 hartree
zpe.sumelectzpe: -933.504555 hartree
zpe.sumelectthermal: -933.491473 hartree
zpe.sumelectthermalent: -933.490529 hartree
zpe.sumelectthermalfe: -933.543551 hartree
dipole: 3.8928 -0.5673 1.2836
dipole: 4.1380
quadrupole: -72.5055 -73.5570 -84.3927
quadrupole: 3.0264 -6.8944 -1.2686
quadrupole: 4.3129 3.2614 -7.5743 3.0264 -6.8944 -1.2686
hfenergy: -933.6677727 hartree
pointgroup: C01 [X(C8H10O3S1)]
dipole: -1.5601974 0.2013851 0.4191383 debye
dipolederiv: 1.6515557 0.004815 0.0818311 0.0499518 1.3366499 0.0767991 0.196427 0.0643503 1.5234193 -0.4677735 -0.0655013 -0.2230955 -0.0689756 -0.5991502 -0.1223648 -0.2916771 -0.1548593 -0.9386717 -0.6835636 -0.0476098 0.0578636 -0.0504171 -0.5566734 0.1121828 0.0260568 0.0878378 -0.5622608 -0.6403598 0.1052501 0.0082921 0.0476461 -0.6636178 -0.0464721 -0.0154434 0.0222688 -0.4389658 0.1425841 -0.0100759 0.0147909 0.0046781 -0.2178443 0.0148567 0.1037905 0.0188863 -0.1954227 -0.0405738 0.3365818 -0.0143677 -0.0993569 0.1923402 -0.0117326 0.0021508 -0.0006357 0.0389368 -0.0672531 -0.3326997 0.0104028 0.1635845 0.2229529 0.0047508 -0.0197086 -0.0186723 0.0284039 -0.1502687 -0.3139421 0.0066128 -0.0147865 -0.080738 0.0003676 -0.0074614 -0.011831 -0.1704144 -0.1017803 0.3102223 -0.0072003 0.0106901 -0.124267 -0.00176 -0.0067509 0.0101901 -0.1721654 0.1773605 0.0003325 0.0071958 0.0078117 0.1666718 -0.006076 0.0163999 -0.0038834 -0.0916489 -0.0607894 -0.189008 -0.0197516 -0.116312 -0.0905465 0.0172176 0.0121066 0.0450694 -0.0234939 0.0146675 0.1883931 -0.0088566 0.1063834 -0.1039033 0.0003048 -0.0103703 -0.0083356 -0.0000573 0.0248435 0.0482305 -0.0076624 0.0781593 -0.0647753 0.0054397 -0.0046251 -0.0003616 0.1575207 0.0111248 -0.0591753 -0.0047591 -0.0875515 -0.0535177 0.0024899 0.0000148 0.0052295 0.1582401 0.0923241 -0.0526927 0.0815219 -0.0227766 0.0835574 -0.0281937 0.0645387 0.0131119 0.0172936 -0.0254073 0.1819961 0.0113632 0.0660993 -0.0463209 -0.0134026 0.0053064 -0.028387 0.12119 0.0611969 -0.0386807 -0.0732305 -0.0244118 0.0829419 0.032073 -0.0739094 -0.0237773 0.0132397 0.0675449 0.0506043 0.0813058 0.0114999 0.0633602 0.0088777 0.0834556 -0.0033821 0.0030917 0.0754377 0.0452123 -0.0813667 0.0080433 0.0617685 -0.0165709 -0.0801066 0.0039752 -0.0079785 -0.0612732 -0.1992941 0.0047294 -0.0632813 -0.0185746 0.0056566 0.0025155 0.0082 0.1131457 -0.1102954 0.0093906 -0.0098273 0.0093938 0.0926977 0.0009204 -0.0098651 0.001024 0.1506561 0.0906984 0.0276507 0.0842084 -0.016072 0.3169886 -0.035364 0.0071555 -0.0260182 0.2759419 unknown
polarizability: 148.7072772|0.3789636|136.5424176|3.3053895|-1.2840387|74.4254986 unknown
InChI: InChI=1S/C8H10O3S/c1-6-4-3-5-7(2)8(6)12(9,10)11/h3-5,9H,1-2H3
charge 0 multiplicity 1
22 atoms
S  1.794611 -0.093508 -0.016072
O  1.983561 0.589844 1.717059
O  2.430334 0.973501 -1.054733
O  2.419973 -1.584635 -0.022957
C  -0.114264 -0.042049 -0.023477
C  -0.700062 1.25242 -0.058999
C  -0.828903 -1.268924 -0.008289
C  -2.117892 1.287753 -0.104958
C  -2.244658 -1.15205 -0.059147
C  -2.880955 0.102932 -0.109734
C  0.071953 2.55835 -0.03923
C  -0.220877 -2.658555 0.058082
H  -2.613409 2.264023 -0.131999
H  -2.840202 -2.071187 -0.05338
H  0.665379 2.689637 -0.960099
H  -0.626879 3.404857 0.057824
H  0.782478 2.586709 0.805085
H  0.424422 -2.873338 -0.81059
H  0.419206 -2.786722 0.947269
H  -1.026385 -3.410516 0.091646
H  -3.97411 0.157772 -0.147096
H  2.966779 0.666287 1.891495
