program: Gaussian 09
title: 000032838
version: EM64L-G09RevD.01
frameworkgroup: C1[X(CH6N3)]
method: RPBEPBE
basis: SDD
operation: Freq
keyword: #p
keyword: freq=noraman
keyword: PBEPBE/SDD
title: #p freq=noraman PBEPBE/SDD
converged: NO YES NO NO
title: Mulliken charges:
elementType: N N N C H H H H H H
charge: -0.587254 -0.587335 -0.587305 0.488324 0.378944 0.378914 0.378909 0.378916 0.378924 0.378963
chargesum: 1.00000
title: Mulliken charges with hydrogens summed into heavy atoms:
elementType: N N N C
charge: 0.170604 0.170490 0.170582 0.488324
polarizability: 3.65688977e+01 -1.17102916e-04 3.65655776e+01 2.27190385e-04 5.15890817e-04 1.48116026e+01
1716.lowfreq: -242.5504 -12.5814 -5.3312 -4.3909 -0.0005 0.0002 0.0009 492.1847 493.0625
frequency: -242.5481 492.1833 493.0615 520.6161 521.7668 586.8690 587.8881 653.7903 707.8974 985.7208 1014.9769 1098.7343 1099.1380 1610.0395 1610.6005 1678.6407 1679.5237 1696.5313 3539.4201 3539.7078 3554.0280 3668.7250 3672.5875 3672.9105
redmass: 1.0078 2.2899 2.2931 1.0086 1.0092 1.3148 1.3149 1.3425 4.2449 4.7296 1.1820 1.5333 1.5324 1.4786 1.4898 2.4724 2.4423 1.1201 1.0476 1.0476 1.0512 1.1042 1.1053 1.1053
irintensity: 0.0005 0.1219 0.1237 0.0099 0.0374 0.0004 0.1607 646.0009 454.3917 0.0000 0.0000 0.5096 0.5140 3.0645 3.6189 483.3257 483.1629 0.3989 222.4614 221.9677 0.0961 0.2168 133.4426 133.0743
temp: 298.150 k
press: 1.00000 atm
elementType: 7 7 7 6 1 1 1 1 1 1
symmnumber: 1
zpe: 231389.8 jmol-1
zpe.correction: 0.088132 hartree
zpe.thermalcorrener: 0.092554 hartree
zpe.thermalcorrenthalpy: 0.093499 hartree
zpe.thermalcorrgfe: 0.061775 hartree
zpe.sumelectzpe: -205.415901 hartree
zpe.sumelectthermal: -205.411478 hartree
zpe.sumelectthermalent: -205.410534 hartree
zpe.sumelectthermalfe: -205.442258 hartree
dipole: -0.0004 0.0003 0.0001
dipole: 0.0005
quadrupole: -9.0268 -9.0298 -26.8230
quadrupole: -0.0005 0.0002 0.0004
quadrupole: 5.9331 5.9301 -11.8632 -0.0005 0.0002 0.0004
hfenergy: -205.5040326 hartree
pointgroup: C01 [X(C1H6N3)]
dipole: 0.0000631 -0.0001877 -0.0000216 debye
dipolederiv: -0.9851489 -0.392419 0.0000138 -0.3924717 -0.5790508 -0.0000025 0.0000119 -0.0000015 -0.6536071 -1.0203527 0.3721272 0.0000169 0.3719595 -0.5438435 0.0000011 0.0000171 -0.0000012 -0.6533987 -0.3407165 0.0202082 -0.0000224 0.0203915 -1.2235922 0.0000014 -0.0000211 0.0000025 -0.6534007 1.7953361 0.0000593 -0.0000335 0.0001269 1.7956505 -0.0000008 -0.0000338 -0.0000008 0.4565669 0.3376472 0.0368994 0.0000017 -0.0164597 0.1793684 0.000005 0.000001 0.0000035 0.4174193 0.2210567 0.0439015 0.0000021 0.097163 0.2957934 0.0000008 0.0000045 0.000006 0.4173635 0.2277141 -0.0470629 0.0000012 -0.1003015 0.2891983 0. 0.0000018 -0.0000022 0.4172391 0.338244 -0.0295378 0.0000008 0.0237429 0.1787016 -0.0000044 -0.0000033 -0.0000028 0.4173269 0.2100791 0.0900907 0.0000097 0.0367747 0.3068693 -0.000003 0.0000102 -0.000003 0.4170929 0.2161409 -0.0942667 0.0000098 -0.0409257 0.300905 0.0000022 0.0000116 -0.0000005 0.417398 unknown
polarizability: 36.5659722|0.0010809|36.5685031|-0.0005635|-0.0000147|14.8116026 unknown
InChI: InChI=1S/CH6N3/c2-1(3)4/h2-4H2
charge 1 multiplicity 1
10 atoms
N  1.159801 0.705766 -0.000047
N  -1.19102 0.651537 0.000013
N  0.03123 -1.357309 -0.000017
C  0.00006 -0.000051 -0.000015
H  2.067208 0.241585 -0.000054
H  1.164179 1.725008 -0.000075
H  -1.242463 1.669493 0.00003
H  -2.076004 0.145876 0.00001
H  -0.824665 -1.910796 0.000024
H  0.911474 -1.871209 -0.000068
