program: Gaussian 09
title: Title Card Required
version: ES64L-G09RevD.01
method: RM062X
basis: 6-31++G(d,p)
operation: Freq
keyword: #N
keyword: Geom=AllCheck
keyword: Guess=TCheck
keyword: SCRF=Check
keyword: GenChk
keyword: RM062X/6-31++G(d,p)
keyword: Freq
keywords: eq
keyword: Fr
title: Mulliken charges:
elementType: C C N H H N N N H H C C N H H N N N H H
charge: 0.084717 0.139172 -0.422562 0.458482 0.222823 -0.215390 -0.443175 -0.530968 0.347463 0.359461 0.084890 0.138960 -0.422869 0.458325 0.222847 -0.215514 -0.443160 -0.530519 0.359594 0.347423
chargesum: 0.00000
title: Mulliken charges with hydrogens summed into heavy atoms:
elementType: C C N N N N C C N N N N
charge: 0.084717 0.361995 0.035920 -0.215390 -0.443175 0.175956 0.084890 0.361807 0.035456 -0.215514 -0.443160 0.176498
dipole: 0.0036 0.0047 0.0011
dipole: 0.0060
quadrupole: -85.1048 -50.3243 -75.0515
quadrupole: 10.5354 -11.6225 -5.4532
quadrupole: -14.9446 19.8359 -4.8913 10.5354 -11.6225 -5.4532
hfenergy: -595.0695586 hartree
pointgroup: C01 [X(C4H8N8)]
dipole: -0.0022919 0.0000614 -0.0004893 debye
dipolederiv: 2.262409 -0.0284403 0.1539817 -0.2408903 0.7054622 0.0000903 0.0687098 0.0349707 0.2568826 0.7432684 0.4509422 0.02813 0.3883215 0.6380011 0.0147924 0.0311063 0.0196733 0.0952358 -0.7813093 -0.7590225 -0.0435812 -0.4234389 -0.526625 -0.0109178 -0.0088714 -0.0240438 -0.229464 0.4863032 0.3253999 0.012548 0.3189518 0.7835883 0.0230957 0.014046 0.0206354 0.3856826 0.0710528 0.0164927 -0.0029249 0.0359852 0.1108687 -0.0000127 -0.0021843 0.0008296 0.1980903 -0.489428 0.2144326 -0.0107559 -0.5209776 -1.0565297 -0.0608462 -0.0100905 -0.0185221 -0.3117723 -1.1730164 -0.1799516 -0.0315015 0.2810484 -0.7559877 0.0221445 -0.0129918 -0.0138853 -0.4122396 -1.6610037 -0.0385104 -0.1535715 0.1607079 -0.3535856 0.0105483 -0.4130419 -0.0261587 -0.6505281 0.2556715 -0.0606866 0.0207438 -0.0704679 0.2212627 -0.0416642 0.154053 -0.0755605 0.3355452 0.2859665 0.0595781 0.0271363 0.0713287 0.2343198 0.0430043 0.1796043 0.0824772 0.3324272 2.2630625 -0.0289525 0.1571483 -0.2420769 0.7060035 -0.002882 0.0724321 0.0322415 0.2572513 0.7443754 0.4511584 0.0267394 0.3883104 0.6372299 0.0130623 0.0297979 0.0175113 0.0952423 -0.7819683 -0.7584454 -0.0410519 -0.4227362 -0.524931 -0.01102 -0.0075913 -0.0238302 -0.2295318 0.4860529 0.3243463 0.0117236 0.3178612 0.7814166 0.0233493 0.0130868 0.020187 0.3857068 0.0710854 0.0165343 -0.0031761 0.036001 0.1108296 0.0004455 -0.0024303 0.0011832 0.198076 -0.4896967 0.2137018 -0.0124353 -0.5220391 -1.0573874 -0.0588701 -0.0088677 -0.0161334 -0.3114802 -1.1730448 -0.1796466 -0.031983 0.2816007 -0.7560309 0.02378 -0.0150422 -0.0120763 -0.4123211 -1.6608561 -0.0380491 -0.1549274 0.1605278 -0.3537646 0.009858 -0.4151279 -0.0268293 -0.6517476 0.2857539 0.0595741 0.0268944 0.0720022 0.2347743 0.0433147 0.1790742 0.0825719 0.3324222 0.2553218 -0.0604554 0.0208632 -0.0700198 0.2210853 -0.0412722 0.1543288 -0.0752414 0.3365223 unknown
polarizability: 158.5379731|5.7225805|147.9706097|3.7499943|1.5007378|82.3410304 unknown
InChI: InChI=1S/2C2H4N4/c2*3-2-4-1-5-6-2/h2*1,5H,3H2
charge 0 multiplicity 1
20 atoms
C  0.42330286 -0.036066 0.1773992
C  -1.47474678 0.86146467 0.13903737
N  -1.62538468 -0.46107376 0.10901589
H  -2.45997093 -1.04610544 0.0674005
H  -2.30462531 1.55304671 0.12564972
N  -0.40801315 -1.06751246 0.13047236
N  -0.18714321 1.17964218 0.18520441
N  1.79339973 -0.17445058 0.28070176
H  2.14388742 -1.05628019 -0.07075106
H  2.3011232 0.61415465 -0.09892346
C  -3.713759 -4.10437653 -0.05012369
C  -1.8166379 -5.00355669 -0.00480742
N  -1.66472374 -3.6810157 0.01872548
H  -0.82948668 -3.09687606 0.05865772
H  -0.98745108 -5.69587056 0.01313166
N  -2.8814796 -3.07350895 -0.00741162
N  -3.10444921 -5.3207275 -0.05098305
N  -5.08348158 -3.96513648 -0.15573163
H  -5.59265823 -4.75200716 0.22545596
H  -5.43391215 -3.08161237 0.19142073
