program: Gaussian 09
title: Title Card Required
version: ES64L-G09RevD.01
method: RM062X
basis: 6-31++G(d,p)
operation: Freq
keyword: #N
keyword: Geom=AllCheck
keyword: Guess=TCheck
keyword: SCRF=Check
keyword: GenChk
keyword: RM062X/6-31++G(d,p)
keyword: Freq
keywords: eq
keyword: Fr
title: Mulliken charges:
elementType: N C N C N S N C O O H H H H N C N C N S N C O O H H H H
charge: 0.104747 -0.389718 -0.149957 -0.227873 -0.013027 0.287282 -0.178308 0.342748 -0.525415 -0.441156 0.268892 0.276039 0.121624 0.524148 0.104764 -0.389743 -0.149886 -0.227879 -0.012973 0.287174 -0.178396 0.342798 -0.525464 -0.441184 0.268921 0.276031 0.121647 0.524163
chargesum: 0.00000
title: Mulliken charges with hydrogens summed into heavy atoms:
elementType: N C N C N S N C O O N C N C N S N C O O
charge: 0.104747 -0.389718 -0.149957 0.317057 -0.013027 0.408906 -0.178308 0.342748 -0.525415 0.082991 0.104764 -0.389743 -0.149886 0.317073 -0.012973 0.408822 -0.178396 0.342798 -0.525464 0.082979
dipole: -0.0002 6.1918 -0.0029
dipole: 6.1918
quadrupole: -199.0491 -128.9495 -125.5992
quadrupole: 0.0222 56.8675 -0.0026
quadrupole: -47.8498 22.2498 25.6001 0.0222 56.8675 -0.0026
hfenergy: -1768.3068675 hartree
pointgroup: C01 [X(C6H8N8O4S2)]
dipole: -0.5509772 2.3675802 -0.1591234 debye
polarizability: 243.1772589|2.3658065|230.1944875|-10.5551873|-5.4089468|186.3112644 unknown
InChI: InChI=1S/2C3H4N4O2S/c2*8-2(9)1-7-3(10)4-5-6-7/h2*8,10H,1H2
charge 0 multiplicity 1
28 atoms
N  -0.39853069 -0.69131812 -0.56367436
C  -1.37980521 0.15446475 -0.18931968
N  -0.87051879 -1.93717486 -0.49962749
C  0.98273796 -0.42009285 -0.88646907
N  -2.4446381 -0.56721003 0.09990936
S  -1.21466041 1.89567547 -0.02987476
N  -2.09082967 -1.84950908 -0.10228798
C  1.78264323 -0.13180775 0.37029888
O  1.28303099 -0.16888232 1.48623471
O  3.02906219 0.14682605 0.10472591
H  1.05370904 0.43008066 -1.56777514
H  1.39397419 -1.29947951 -1.38567694
H  -1.18940318 2.14057492 -1.35070024
H  3.5413353 0.32498771 0.95213972
N  5.99924974 1.1307007 4.38518285
C  6.51927476 2.26645843 3.87725052
N  6.97258504 0.22229972 4.46598835
C  4.63054682 0.80551285 4.71159798
N  7.80095565 2.05613228 3.65053942
S  5.61027351 3.72169129 3.50243143
N  8.04116775 0.78618215 4.02456889
C  3.82304559 0.54990978 3.45261032
O  4.32063163 0.5957323 2.33609909
O  2.57413488 0.28202306 3.71744255
H  4.17273411 1.61701436 5.28071799
H  4.63329606 -0.09342849 5.33089776
H  5.44089579 4.09668351 4.78144883
H  2.06099758 0.10747218 2.86981611
