program: Gaussian 09
title: Title Card Required
version: ES64L-G09RevD.01
method: RM062X
basis: 6-31++G(d,p)
operation: Freq
keyword: #N
keyword: Geom=AllCheck
keyword: Guess=TCheck
keyword: SCRF=Check
keyword: GenChk
keyword: RM062X/6-31++G(d,p)
keyword: Freq
keywords: eq
keyword: Fr
title: Mulliken charges:
elementType: C C N C C N C C C S O C C H H H H H H H H H H C C N C C N C C C S O C C H H H H H H H H H H
charge: -0.179908 -0.183973 -0.358275 -0.172092 -0.090397 -0.221654 -0.089287 0.360136 -0.525508 0.144008 -0.388170 0.279869 -0.823977 0.407249 0.207949 0.207033 0.142343 0.423662 0.164330 0.164699 0.177883 0.176082 0.177803 -0.179758 -0.184024 -0.358250 -0.172219 -0.090394 -0.221717 -0.089313 0.360260 -0.525343 0.143956 -0.388170 0.279874 -0.823985 0.407248 0.207945 0.207044 0.142351 0.423889 0.164339 0.164690 0.177884 0.176082 0.177802
chargesum: 0.00000
title: Mulliken charges with hydrogens summed into heavy atoms:
elementType: C C N C C N C C C S O C C C C N C C N C C C S O C C
charge: -0.179908 -0.183973 0.048974 0.035858 0.116636 0.202236 -0.089287 0.502479 -0.525508 0.144008 -0.388170 0.608898 -0.292208 -0.179758 -0.184024 0.048998 0.035726 0.116650 0.201944 -0.089313 0.502611 -0.525343 0.143956 -0.388170 0.608903 -0.292216
dipole: -0.0002 0.0009 -7.6019
dipole: 7.6019
quadrupole: -83.0365 -154.4515 -183.0690
quadrupole: 31.3949 0.0020 -0.0029
quadrupole: 57.1491 -14.2658 -42.8833 31.3949 0.0020 -0.0029
hfenergy: -1863.4262168 hartree
pointgroup: C01 [X(C18H20N4O2S2)]
dipole: 0.020648 -0.09061 2.9893867 debye
polarizability: 577.2150484|-25.8984927|392.4948877|-2.6713151|2.777914|306.362147 unknown
InChI: InChI=1S/2C9H10N2OS/c2*1-2-12-6-3-4-7-8(5-6)11-9(13)10-7/h2*3-5,10-11H,2H2,1H3
charge 0 multiplicity 1
46 atoms
C  0.92444325 0.75422481 -0.54997979
C  0.59097738 -0.58162707 -0.8168483
N  2.22133721 0.92601366 -1.02656682
C  0.02326876 1.60431481 0.07358525
C  -0.64329334 -1.11517923 -0.47675875
N  1.69704375 -1.14226688 -1.43808991
C  2.6877813 -0.22602046 -1.56418272
C  -1.22265023 1.08421046 0.42353072
C  -1.55158402 -0.25785296 0.15120861
S  4.21690808 -0.46940899 -2.26211946
O  -2.75146337 -0.81561354 0.46883402
C  -3.73221713 -0.00294395 1.11233275
C  -4.95362108 -0.86673218 1.34082158
H  2.76981117 1.77399156 -0.98721186
H  0.27132899 2.63819227 0.28552549
H  -0.90997761 -2.14576988 -0.68082906
H  -1.93569895 1.73592781 0.91153169
H  4.42810542 -2.75204862 -1.81029676
H  -3.97165485 0.85608291 0.47338762
H  -3.33054022 0.36996326 2.06272773
H  -5.34639583 -1.23423466 0.38947417
H  -5.73249244 -0.28183306 1.83590708
H  -4.70513249 -1.72221659 1.97381186
C  5.29896486 -5.68321307 -0.7750436
C  5.62946284 -4.33363395 -0.96563434
N  3.99548291 -5.82634551 -1.24307073
C  6.20818183 -6.5690691 -0.21631638
C  6.86862281 -3.82120438 -0.6111551
N  4.51525189 -3.73693323 -1.53669661
C  3.522339 -4.64419241 -1.70395129
C  7.45912221 -6.07064648 0.14702884
C  7.78501413 -4.71453644 -0.04853506
S  1.9838649 -4.35961719 -2.36478607
O  8.98946633 -4.17656193 0.28550463
C  9.97871214 -5.02630241 0.86492528
C  11.20365718 -4.17751137 1.12803384
H  3.44724081 -6.67537312 -1.24750792
H  5.96247497 -7.61389256 -0.06358822
H  7.1330794 -2.78013703 -0.75650051
H  8.17848845 -6.75037962 0.58497039
H  1.78003473 -2.10878449 -1.77186062
H  10.20869277 -5.8450999 0.17196559
H  9.59021985 -5.45605219 1.79661326
H  11.58332774 -3.75312891 0.1952225
H  11.98903648 -4.79099071 1.57600784
H  10.96447907 -3.36187683 1.81492106
