program: Gaussian 09
title: Title Card Required
version: ES64L-G09RevD.01
method: RM062X
basis: 6-31++G(d,p)
operation: Freq
keyword: #N
keyword: Geom=AllCheck
keyword: Guess=TCheck
keyword: SCRF=Check
keyword: GenChk
keyword: RM062X/6-31++G(d,p)
keyword: Freq
keywords: eq
keyword: Fr
title: Mulliken charges:
elementType: C C N C C S N H H H H H H C C N C C S N H H H H H H
charge: -0.229291 0.612519 -0.463540 -0.599443 -0.770611 0.437564 -0.485504 0.204856 0.188187 0.176193 0.187840 0.366082 0.414847 -0.436191 0.570010 -0.552783 -0.583391 -0.659209 0.586225 -0.472987 0.227744 0.181917 0.173652 0.212794 0.359825 0.352694
chargesum: 0.00000
title: Mulliken charges with hydrogens summed into heavy atoms:
elementType: C C N C C S N C C N C C S N
charge: -0.229291 0.817375 -0.463540 -0.047223 -0.770611 0.437564 0.295425 -0.436191 0.797754 -0.552783 -0.015027 -0.659209 0.586225 0.239531
dipole: 2.3341 -0.5851 2.1710
dipole: 3.2410
quadrupole: -84.8172 -88.7087 -96.0418
quadrupole: 23.0655 1.1480 -2.0074
quadrupole: 5.0387 1.1472 -6.1859 23.0655 1.1480 -2.0074
hfenergy: -1327.1989583 hartree
pointgroup: C01 [X(C8H12N4S2)]
dipole: -0.946018 0.6670805 -0.5347027 debye
dipolederiv: 0.5190287 0.0418537 -0.1311141 0.2791024 0.440792 0.4219281 0.2284151 0.528732 0.7770381 -0.8830983 -0.519192 -0.5278525 -0.3495724 -0.6273542 -0.279392 -0.3333314 -0.2537951 -0.5977501 -0.3863333 0.1341543 0.1603219 0.2452134 -0.5358149 -0.2157432 0.3371805 -0.2012767 -0.876504 -0.1472878 -0.0986315 -0.0486177 -0.0605848 0.0825576 -0.0235925 0.0409483 -0.0000372 0.0993023 1.129856 0.6903992 0.4971878 0.5205818 0.7966416 0.9583791 0.2525656 0.8813298 1.1526337 0.0395301 0.0998378 0.3311061 -0.0768012 0.1168848 -0.0277269 0.0634831 -0.1082959 0.0172171 -0.9661071 -0.2437091 -0.333032 -0.4920595 -1.398853 -0.8742666 -0.4578957 -0.5733663 -1.1140936 0.0308196 0.0114161 0.1060294 -0.0045182 0.1963859 -0.0908348 0.0868665 -0.0903659 0.081927 -0.0824414 0.0344028 -0.0397037 0.085295 -0.0375392 0.0080806 -0.0607021 -0.0184819 0.1016119 0.0502308 0.0190649 0.0538746 -0.0349915 0.0426535 -0.0835472 -0.0367049 -0.1088983 -0.0595712 -0.0068067 -0.0642131 -0.0070386 -0.1152445 0.0057629 0.0677207 0.0147547 0.09623 -0.0215761 0.1488839 -0.0918614 -0.0469792 -0.0352094 0.4348787 0.0791961 -0.0071061 -0.0480275 0.2314164 0.8668476 -0.0448595 0.0184505 -0.0165907 0.4559949 0.0964056 -0.0947921 -0.0803404 0.1668975 0.6293851 0.0537943 -0.523788 -0.417804 0.5218125 0.207163 -0.4837681 -0.0515552 0.626805 -0.7769594 -0.1166909 0.4667275 -0.31946 -0.3315568 0.3404801 0.6184093 0.1706852 -0.9596689 -0.9003744 0.3542286 0.0092398 0.3353659 -0.788133 -0.244021 0.0203485 -0.4321101 -0.5201533 0.0139014 -0.0887083 0.0759844 -0.094451 -0.0693799 0.1555221 0.0348458 0.0405188 0.028655 1.0746007 -0.1931267 -1.1172836 0.1022251 0.796516 -0.2132139 -1.2520693 0.1094638 1.29006 0.1429052 -0.0824195 0.0977292 0.229994 -0.1789141 -0.0911888 0.0093058 0.1590635 0.1161983 -1.5914825 0.0760755 0.9794798 0.0982088 -0.4165733 -0.13921 0.6831663 -0.1038267 -1.1576896 0.1896825 0.0336584 0.0704818 0.0607232 -0.0217982 -0.0135676 0.072772 0.0107174 0.1727116 -0.0170576 0.0854441 -0.0448262 0.0467877 0.0078755 0.0953574 0.0074789 0.1035752 0.0221463 0.0617166 0.0128975 0.0825024 0.05888 -0.0045834 -0.1114439 0.0845492 -0.0115022 -0.0009254 -0.0142619 -0.1257557 0.0030057 -0.1045408 0.0436243 -0.0131781 -0.0336374 -0.0157272 -0.0075452 0.4306281 -0.0656292 -0.0291855 -0.0771677 0.2433424 0.0726106 0.1307588 0.0050802 0.1944939 0.4441942 0.0875695 -0.1026999 0.1366185 0.2247777 -0.0819167 0.0741588 -0.0077893 0.2363634 unknown
polarizability: 235.2886353|15.2366532|206.0786611|-28.2492152|14.3673639|211.7786546 unknown
InChI: InChI=1S/2C4H6N2S/c2*1-3-2-4(5)7-6-3/h2*2H,5H2,1H3
charge 0 multiplicity 1
26 atoms
C  0.35722424 0.79820494 1.2167555
C  0.22214706 0.00958235 0.03701676
N  -0.72713891 0.97582276 1.94182251
C  1.65070998 1.4233457 1.65184427
C  -1.07476621 -0.42738813 -0.11821221
S  -2.02100498 0.18065901 1.21206355
N  -1.60486407 -1.25265961 -1.06869857
H  1.03117724 -0.22228 -0.64465419
H  2.42222752 0.65912322 1.78225404
H  1.51439243 1.95523649 2.59438334
H  2.00790261 2.12800229 0.89504656
H  -1.06856951 -1.34338176 -1.92095517
H  -2.61615554 -1.21325672 -1.19363563
C  -4.64984642 0.73282428 -0.81117695
C  -5.52302834 1.29675605 0.15849898
N  -4.48553501 -0.57586897 -0.76857536
C  -3.8809986 1.53738203 -1.8158506
C  -6.03091075 0.32052618 0.98656206
S  -5.40180145 -1.21871727 0.48714934
N  -6.9465632 0.44301546 1.99521271
H  -5.75164009 2.35168655 0.24398785
H  -4.5325668 2.25546113 -2.31997321
H  -3.42440312 0.88269432 -2.56015341
H  -3.08809416 2.09928992 -1.31015437
H  -7.06344068 1.37469624 2.37071608
H  -6.96740726 -0.27848847 2.70259214
