program: Gaussian 09
title: 000032837
version: EM64L-G09RevD.01
frameworkgroup: C1[X(C8H14O)]
method: RPBEPBE
basis: SDD
operation: Freq
keyword: #pfreq=noraman
keyword: PBEPBE/SDD
title: #p freq=noraman PBEPBE/SDD
converged: NO YES NO NO
title: Mulliken charges:
elementType: O C C C C C C C C H H H H H H H H H H H H H H
charge: -0.460806 0.299530 -0.523397 -0.517178 -0.759700 -0.028464 -0.014066 -0.595288 -0.600361 0.224410 0.236075 0.194643 0.225628 0.202887 0.227435 0.237431 0.218346 0.242347 0.325720 0.212086 0.223927 0.214429 0.214366
chargesum: 0.00000
title: Mulliken charges with hydrogens summed into heavy atoms:
elementType: O C C C C C C C C
charge: -0.135086 0.299530 -0.062912 -0.096907 -0.091947 0.189881 0.228281 -0.159274 -0.171566
polarizability: 1.05580744e+02 -1.26213282e+01 8.73222084e+01 2.39390985e+00 5.50708175e+00 6.98896497e+01
1716.lowfreq: -20.7196 -17.8700 -0.0006 -0.0005 -0.0005 5.9213 54.0178 61.0377 88.7920
frequency: 54.0141 60.8240 88.7659 125.2253 192.7896 220.3228 242.3519 294.6423 311.5072 331.2218 348.5659 397.8712 440.6692 453.1907 492.6903 596.6296 646.3951 771.2659 856.0444 862.4494 912.8962 927.3267 940.7872 946.5752 960.7107 963.8729 1007.3968 1022.1096 1028.6721 1078.1687 1104.5355 1144.0336 1179.7758 1198.4978 1256.6060 1280.1244 1288.5413 1300.7139 1320.2297 1340.7755 1382.3717 1425.5214 1426.4427 1442.2541 1457.7455 1468.8093 1476.0408 1657.6493 1658.3687 2936.2314 2972.6344 2985.5986 3034.6083 3056.2078 3062.3516 3078.7067 3081.9452 3087.8212 3093.9700 3100.2524 3190.8728 3195.0784 3539.6060
redmass: 3.1528 2.5810 2.3785 2.5641 2.4236 1.5519 1.3612 1.4060 1.5914 3.1236 3.0523 1.9738 2.6220 2.0985 2.1214 1.6521 1.6561 2.8437 1.8286 2.3999 1.7971 1.4290 1.3692 1.4263 1.8597 1.5492 1.1662 1.1666 1.5554 1.5424 1.6624 2.1433 2.0970 1.3713 1.3923 1.2898 1.3051 1.3512 1.5245 1.9304 1.2236 1.1755 1.1804 1.1051 1.0853 1.0669 1.0644 4.7500 4.7037 1.0669 1.0372 1.0623 1.0919 1.0955 1.0965 1.0742 1.0599 1.0991 1.0812 1.0931 1.1143 1.1149 1.0657
irintensity: 0.0614 0.1927 0.4652 1.9225 1.3191 0.7369 2.1008 58.1478 88.7040 9.3195 5.1827 0.3351 4.1134 8.1328 5.6894 2.3981 31.9615 2.2381 12.2067 15.7340 14.2377 11.6200 138.6923 10.1960 4.8304 2.6596 26.0568 12.7164 14.1758 60.2397 19.0423 18.8613 14.3012 6.5189 14.5214 5.6587 8.8931 6.9966 12.9537 18.8673 24.6830 9.8125 3.5253 11.2232 7.5981 12.7157 13.2228 19.2052 4.6311 36.0653 29.9486 16.5237 11.4454 3.3695 37.8443 35.1532 9.4692 26.8323 11.9983 9.4732 34.8346 24.0915 3.5371
temp: 298.150 k
press: 1.00000 atm
elementType: 8 6 6 6 6 6 6 6 6 1 1 1 1 1 1 1 1 1 1 1 1 1 1
symmnumber: 1
zpe: 519184.5 jmol-1
zpe.correction: 0.197747 hartree
zpe.thermalcorrener: 0.209029 hartree
zpe.thermalcorrenthalpy: 0.209973 hartree
zpe.thermalcorrgfe: 0.161043 hartree
zpe.sumelectzpe: -387.693096 hartree
zpe.sumelectthermal: -387.681814 hartree
zpe.sumelectthermalent: -387.680870 hartree
zpe.sumelectthermalfe: -387.729801 hartree
dipole: 0.5749 -0.4348 1.8149
dipole: 1.9528
quadrupole: -55.0086 -54.0400 -59.2181
quadrupole: -2.0380 3.3947 0.0801
quadrupole: 1.0803 2.0489 -3.1292 -2.0380 3.3947 0.0801
hfenergy: -387.8908432 hartree
pointgroup: C01 [X(C8H14O1)]
dipole: -0.275202 -0.0827105 -0.712508 debye
dipolederiv: -0.6770043 0.0591299 0.2318558 0.0658586 -0.5732512 0.2508247 0.2283572 0.2246108 -0.4765176 0.6665469 0.0237374 -0.1058185 0.0348198 0.5646376 -0.1153796 -0.1138238 -0.0478819 0.3934998 -0.0788475 -0.0864886 0.018849 -0.0610479 -0.024741 0.031028 -0.0273217 0.0290314 0.0086701 -0.1115174 0.0996938 0.0082411 0.1144378 0.0007873 -0.0029748 0.0219562 0.0764347 -0.0312656 -0.1038555 0.0918862 -0.1039588 0.0527797 -0.0426539 0.064264 -0.0205713 0.0563816 -0.0729696 0.1746753 0.0389228 0.0151883 0.0529868 0.0510709 -0.1901776 -0.0914853 -0.305171 -0.0493582 0.1484546 -0.085901 -0.0220904 -0.0818924 -0.0866202 -0.1319115 0.1250178 -0.2436719 0.0601699 -0.1523704 -0.081798 0.0240858 -0.048558 -0.1572206 -0.2467289 0.0206533 -0.2490438 -0.1662654 -0.171301 0.0020162 -0.050895 0.0134656 -0.3013579 -0.2226556 -0.0433099 -0.2285268 -0.0200223 -0.0258552 0.0766122 0.1032567 0.0437301 -0.0182613 -0.0598872 0.1004656 -0.0405913 0.0283525 -0.0256473 0.0414878 -0.1035595 0.0014466 0.0381811 0.0762625 -0.0786037 0.0729672 0.008914 -0.0817455 -0.0835776 -0.1084301 -0.0585374 -0.0499072 -0.0794553 -0.1143501 -0.0497641 0.0156088 -0.0067339 -0.0318341 0.1011423 0.0035191 0.0352622 0.0925548 0.0581143 0.0921977 -0.0232118 -0.0065487 -0.0864889 -0.0765415 -0.1499321 -0.0690084 -0.0916676 -0.074496 -0.0558987 0.033383 0.0491221 -0.0557436 0.102207 -0.0353557 0.0333139 0.098558 0.0832886 0.1009073 -0.0323637 -0.010729 0.1098805 0.0332388 0.12223 -0.0184592 -0.0495379 0.0775162 -0.0754663 0.0331367 -0.0074329 0.0768324 -0.0663514 0.0568581 0.0260051 0.1170905 -0.036896 0.1511279 0.0254102 0.0531723 -0.0290961 0.0730182 -0.0169672 0.1128697 0.0786165 0.0111075 0.1186734 -0.0280095 0.2699661 -0.1486045 -0.0791856 -0.1549915 0.1809857 -0.102396 -0.1420691 -0.1523849 0.1562296 0.0213388 -0.0773854 0.0433096 -0.0798117 0.0232699 0.1287183 0.0675853 0.1479315 0.076866 0.0320114 0.0528071 -0.0397721 0.0819305 0.0615247 0.1222523 -0.0521644 0.1324772 0.0628988 -0.0043496 0.0989042 -0.0517923 0.0804179 0.0933472 0.112631 -0.0796912 0.1317096 0.0288876 0.0486507 -0.0049927 0.0540027 -0.0373868 0.1202257 0.1199714 0.0807207 0.1139502 -0.0320434 unknown
polarizability: 112.0290375|-0.2858438|80.2449046|-0.1534748|-6.5152192|70.5186596 unknown
InChI: InChI=1S/C8H14O/c1-4-6-8(3,9)7-5-2/h4-5,9H,1-2,6-7H2,3H3
charge 0 multiplicity 1
23 atoms
O  -1.816827 -0.76289 1.047918
C  -1.057929 -0.040752 -0.014292
C  -0.257496 1.020461 0.787858
C  -0.124409 -1.044349 -0.758029
C  -2.057998 0.598906 -1.000128
C  0.528067 1.994826 -0.064714
C  0.80201 -1.815524 0.159587
C  1.88064 2.105164 -0.069888
C  2.125248 -2.020041 -0.058744
H  -0.994504 1.569309 1.407681
H  0.419471 0.489347 1.480353
H  -0.776422 -1.760924 -1.306679
H  0.462722 -0.500213 -1.52132
H  -2.682959 -0.178459 -1.482254
H  -1.539606 1.149716 -1.805198
H  -2.727166 1.298242 -0.468299
H  -0.059349 2.672425 -0.704328
H  0.325784 -2.237666 1.057208
H  -2.399361 -1.436127 0.609632
H  2.395893 2.84532 -0.693269
H  2.508097 1.454229 0.551364
H  2.736367 -2.608098 0.635834
H  2.636327 -1.6040 -0.936491
