program: Gaussian 09
title: Title Card Required
version: ES64L-G09RevD.01
method: RM062X
basis: 6-31++G(d,p)
operation: Freq
keyword: #N
keyword: Geom=AllCheck
keyword: Guess=TCheck
keyword: SCRF=Check
keyword: GenChk
keyword: RM062X/6-31++G(d,p)
keyword: Freq
keywords: eq
keyword: Fr
title: Mulliken charges:
elementType: C C N C N C O O H H H H H H H H C C N C N C O O H H H H H H H H
charge: 0.215659 0.168584 -0.415634 -0.579045 -0.449976 -0.667894 -0.198417 -0.168690 0.179211 0.218415 0.201986 0.180737 0.216951 0.195587 0.420264 0.482265 0.168615 0.215595 -0.449971 -0.667862 -0.415617 -0.579069 -0.168696 -0.198422 0.180732 0.216939 0.195594 0.179223 0.218429 0.201979 0.482264 0.420265
chargesum: 0.00000
title: Mulliken charges with hydrogens summed into heavy atoms:
elementType: C C N C N C O O C C N C N C O O
charge: 0.215659 0.168584 -0.415634 0.020567 -0.449976 -0.074620 0.221847 0.313575 0.168615 0.215595 -0.449971 -0.074598 -0.415617 0.020562 0.313568 0.221843
dipole: 0.0001 -0.0001 0.6864
dipole: 0.6864
quadrupole: -69.2202 -82.3813 -96.1217
quadrupole: 8.6722 0.0000 0.0001
quadrupole: 13.3542 0.1931 -13.5473 8.6722 0.0000 0.0001
hfenergy: -833.8885247 hartree
pointgroup: C01 [X(C8H16N4O4)]
dipole: 0.0000346 -0.0000327 0.2700482 debye
polarizability: 230.9542388|-16.9200814|215.1633855|-0.0006976|0.0015119|136.8208946 unknown
InChI: InChI=1S/2C4H8N2O2/c2*1-3(5-7)4(2)6-8/h2*7-8H,1-2H3
charge 0 multiplicity 1
32 atoms
C  3.55479972 0.00821308 0.10625421
C  2.49732559 1.04453031 -0.04255634
N  3.32331297 -1.11935486 -0.45436149
C  4.80245712 0.31741111 0.88277322
N  1.29100692 0.62845288 0.04518106
C  2.86603779 2.48135254 -0.26730137
O  4.35368142 -2.01753504 -0.2253413
O  0.35265944 1.62187406 -0.11649536
H  4.73682041 1.29374322 1.363135
H  5.6763784 0.29904991 0.22434984
H  4.95426375 -0.44862645 1.64744985
H  3.92913359 2.58747268 -0.4841845
H  2.6200831 3.08103653 0.61487529
H  2.28509063 2.87731436 -1.10383826
H  4.07923243 -2.8128624 -0.70008516
H  -0.48714127 1.11874538 -0.03790014
C  -2.49732892 -1.04450516 -0.04261162
C  -3.55482518 -0.0082223 0.10627641
N  -1.2910154 -0.62840977 0.04510629
C  -2.86601253 -2.48132474 -0.26742301
N  -3.32340742 1.1193566 -0.45434437
C  -4.80242719 -0.31749147 0.88285773
O  -0.35266326 -1.62181141 -0.11666685
O  -4.35379827 2.01750094 -0.22528423
H  -3.92916456 -2.58749439 -0.48400282
H  -2.61974325 -3.08110296 0.61459987
H  -2.28529356 -2.87714059 -1.10419023
H  -4.73655995 -1.29367361 1.36349552
H  -5.67634149 -0.29955141 0.22441049
H  -4.95444101 0.44872926 1.64730645
H  0.48713738 -1.11868984 -0.03802186
H  -4.0793794 2.81284753 -0.70001332
